program: Gaussian 09
title: 000078849
version: EM64L-G09RevD.01
frameworkgroup: C1[X(C10H22)]
method: RPBEPBE
basis: SDD
operation: Freq
keyword: #p
keyword: freq=noraman
keyword: PBEPBE/SDD
title: #p freq=noraman PBEPBE/SDD
converged: YES YES NO NO
title: Mulliken charges:
elementType: C C C C C C C C C C H H H H H H H H H H H H H H H H H H H H H H
charge: 0.379535 0.379481 -0.410035 -0.409825 -0.807232 -0.792365 -0.807466 -0.792284 -0.741184 -0.741169 0.213073 0.198737 0.212921 0.198707 0.210189 0.226602 0.220725 0.229273 0.209316 0.210809 0.226685 0.210177 0.220762 0.209311 0.229293 0.210799 0.228146 0.211750 0.212668 0.211743 0.228185 0.212671
chargesum: 0.00000
title: Mulliken charges with hydrogens summed into heavy atoms:
elementType: C C C C C C C C C C
charge: 0.379535 0.379481 0.001775 0.001803 -0.149716 -0.142966 -0.149841 -0.142881 -0.088620 -0.088569
polarizability: 1.20595689e+02 -2.22018735e-03 1.03668971e+02 3.47660447e-03 -2.42905379e-05 1.00448205e+02
1716.lowfreq: -22.3491 -9.6962 0.0005 0.0005 0.0007 6.3848 82.5088 97.5204 115.9932
frequency: 82.5079 97.4554 115.9929 182.5469 204.3514 213.8852 224.4677 239.9678 279.3294 295.0826 304.7056 313.4870 340.9820 345.6562 349.8372 364.7659 384.6143 389.9834 447.0762 456.9640 537.5647 641.8703 749.8732 770.2176 779.5282 837.2568 904.0544 915.4482 931.7882 933.6548 978.0392 982.9589 1013.6257 1024.2209 1027.3680 1034.6400 1059.8393 1065.3571 1146.1663 1177.6568 1179.3058 1210.7591 1228.5052 1233.6404 1288.4065 1308.5841 1327.9278 1335.2467 1373.0914 1379.4270 1384.5752 1384.8525 1394.6368 1407.4079 1459.0836 1459.1826 1460.5985 1469.9078 1472.6203 1474.6599 1480.0871 1482.5554 1487.0539 1489.1684 1493.2951 1496.6311 1504.0662 1504.7960 2969.2889 2972.2384 2975.4622 2976.2988 2977.4037 2978.0444 2979.8286 2985.0583 3022.9288 3026.9849 3061.6298 3062.6098 3063.7940 3065.3116 3068.1169 3071.7583 3072.3491 3073.0513 3076.5353 3079.1772 3079.9073 3081.1544
redmass: 2.1335 1.6845 2.1708 1.7968 1.5712 1.0522 1.1453 1.4749 1.4118 1.2546 1.2600 2.0562 2.1462 2.2830 2.6324 2.1563 2.0325 2.2207 2.5612 2.5252 2.2630 2.8256 2.3649 1.2037 1.2617 1.9819 1.7708 1.8489 1.5635 1.4619 1.2586 1.2347 1.6088 1.8557 1.8451 1.7125 1.6902 1.8286 1.9826 2.3737 2.4498 2.4789 3.0263 2.8416 1.3330 1.3013 1.3946 1.3799 1.2094 1.2270 1.1970 1.2135 1.1979 1.1854 1.0561 1.0695 1.0548 1.0526 1.0505 1.0453 1.0662 1.0593 1.0538 1.0467 1.0471 1.0531 1.0544 1.0522 1.0586 1.0538 1.0380 1.0358 1.0361 1.0357 1.0374 1.0394 1.1001 1.0992 1.0995 1.0993 1.0988 1.0987 1.0996 1.0978 1.0979 1.0989 1.0981 1.0985 1.0996 1.0988
irintensity: 0.0009 0.0351 0.0027 0.0021 0.0485 0.0086 0.0000 0.0543 0.0187 0.0751 0.0271 0.0615 0.0010 0.0907 0.0847 0.0494 0.1690 0.7404 0.2042 0.0257 2.4654 1.8674 4.7405 4.0808 4.8844 0.8945 1.3482 1.3446 0.2616 1.2032 1.9468 0.3644 2.3605 9.6679 10.1822 0.0427 5.0765 4.4187 35.6814 6.9882 2.5501 0.0091 0.6974 0.7822 3.1206 0.5633 5.1660 0.0002 15.6565 1.0713 26.7068 6.7649 53.8789 11.0955 4.3713 0.3436 0.9000 0.8978 8.1132 23.2671 1.4280 6.1361 8.7335 3.2096 21.9093 4.0429 3.8663 13.8138 52.5423 8.3021 46.6269 7.0208 61.1496 8.1783 65.0107 1.4346 19.0563 8.4726 0.3999 31.5119 49.0427 22.6339 32.5373 3.3563 115.4431 60.2378 43.3611 77.6452 91.5357 2.6839
temp: 298.150 k
press: 1.00000 atm
elementType: 6 6 6 6 6 6 6 6 6 6 1 1 1 1 1 1 1 1 1 1 1 1 1 1 1 1 1 1 1 1 1 1
symmnumber: 1
zpe: 777774.8 jmol-1
zpe.correction: 0.296239 hartree
zpe.thermalcorrener: 0.309701 hartree
zpe.thermalcorrenthalpy: 0.310645 hartree
zpe.thermalcorrgfe: 0.258852 hartree
zpe.sumelectzpe: -393.389302 hartree
zpe.sumelectthermal: -393.375840 hartree
zpe.sumelectthermalent: -393.374896 hartree
zpe.sumelectthermalfe: -393.426689 hartree
dipole: -0.0001 -0.1087 0.0000
dipole: 0.1087
quadrupole: -68.3269 -67.6025 -67.7101
quadrupole: -0.0009 -0.3257 0.0003
quadrupole: -0.4471 0.2773 0.1697 -0.0009 -0.3257 0.0003
hfenergy: -393.6855412 hartree
pointgroup: C01 [X(C10H22)]
dipole: -0.0000607 -0.0427783 -0.0000959 debye
polarizability: 120.5954672|-0.0029278|103.6689568|-0.0668371|0.0068042|100.4484408 unknown
InChI: InChI=1S/C10H22/c1-7-9(3,4)10(5,6)8-2/h7-8H2,1-6H3
charge 0 multiplicity 1
32 atoms
C  0.790728 0.299228 0.155497
C  -0.79088 0.300083 -0.153841
C  1.488062 -0.880234 -0.611347
C  -1.489299 -0.880339 0.610526
C  1.052239 0.152595 1.683995
C  1.438074 1.638051 -0.304994
C  -1.051953 0.156149 -1.682641
C  -1.437355 1.638655 0.30869
C  2.955695 -1.176843 -0.225316
C  -2.955907 -1.177372 0.220965
H  1.453168 -0.662859 -1.696543
H  0.903933 -1.810425 -0.463582
H  -1.456829 -0.6640 1.695992
H  -0.904408 -1.810107 0.463067
H  0.446365 0.868199 2.26934
H  0.824785 -0.864864 2.049762
H  2.112751 0.359229 1.91621
H  1.105711 2.485479 0.320096
H  1.199549 1.876186 -1.358158
H  2.538755 1.582831 -0.219491
H  -0.823883 -0.860564 -2.05009
H  -0.446218 0.873048 -2.266546
H  -2.112504 0.362724 -1.914757
H  -1.199543 1.874506 1.36253
H  -1.103581 2.486978 -0.314437
H  -2.537998 1.584722 0.222054
H  3.048012 -1.50805 0.824311
H  3.609245 -0.295458 -0.360492
H  3.359463 -1.984805 -0.863995
H  -3.610306 -0.296595 0.355925
H  -3.045743 -1.507206 -0.829317
H  -3.360529 -1.986445 0.857688
