program: Gaussian 09
title: 000080304
version: EM64L-G09RevD.01
frameworkgroup: C1[X(C5H20O5Si5)]
method: RPBEPBE
basis: SDD
operation: Freq
keyword: #p
keyword: freq=noraman
keyword: PBEPBE/SDD
title: #p freq=noraman PBEPBE/SDD
converged: YES YES NO NO
title: Mulliken charges:
elementType: Si Si Si Si Si O O O O O C C C C C H H H H H H H H H H H H H H H H H H H H
charge: 1.382510 1.392581 1.390888 1.398288 1.397811 -0.968490 -0.965818 -0.979063 -0.976851 -0.983740 -1.053169 -1.063964 -1.054927 -1.055657 -1.054995 -0.112354 -0.106066 -0.119420 -0.111697 -0.112855 0.247350 0.248391 0.256647 0.259762 0.246751 0.247612 0.257675 0.248369 0.245941 0.256749 0.247872 0.244656 0.246758 0.257683 0.244776
chargesum: 0.00000
title: Mulliken charges with hydrogens summed into heavy atoms:
elementType: Si Si Si Si Si O O O O O C C C C C
charge: 1.270155 1.286515 1.271468 1.286590 1.284956 -0.968490 -0.965818 -0.979063 -0.976851 -0.983740 -0.300780 -0.309839 -0.302942 -0.306381 -0.305779
polarizability: 1.91749334e+02 -4.64788706e-01 1.81976395e+02 2.11425094e+00 1.00317217e+00 1.52852338e+02
1716.lowfreq: -6.7196 -1.8660 0.0009 0.0014 0.0015 3.7807 6.9826 24.1522 34.3082
frequency: 6.4900 24.0950 34.2686 37.4111 38.9662 43.8796 48.6587 53.6954 56.0384 129.3997 138.1462 143.2468 146.0809 148.2713 154.7883 156.3088 158.2504 187.3656 194.7802 216.8634 228.6340 239.7442 267.4059 287.4804 299.8881 322.0636 326.8022 351.5322 363.3367 464.0734 481.7009 488.3079 547.4182 548.9416 674.7581 677.4821 686.4561 688.1345 691.4010 748.8855 768.1699 769.0698 773.3529 777.5199 778.4688 784.2656 785.8081 792.7640 801.8924 861.6337 895.5690 897.0895 907.3293 911.0593 928.2262 928.7937 930.4237 934.7390 937.1208 1024.8504 1062.2771 1069.4076 1083.1724 1084.2140 1316.5761 1317.5875 1318.2310 1318.7696 1319.6285 1441.7914 1442.3945 1443.1036 1443.7050 1444.4167 1445.0874 1445.8205 1446.2483 1446.6166 1447.6843 2107.6737 2111.1693 2112.1089 2116.7681 2138.7967 2991.9888 2994.7312 2995.0926 2995.8770 2996.9795 3098.5165 3100.3653 3101.4367 3102.0148 3103.1828 3103.3815 3103.7419 3103.9493 3104.0754 3105.5650
redmass: 3.6226 4.0746 4.7180 3.9603 4.4196 4.5182 4.8071 4.7134 5.4536 1.0440 1.0398 2.6378 1.0807 2.6573 1.0467 1.0789 3.1973 3.2823 3.5397 4.2931 4.6652 4.6365 4.1687 3.8864 5.2470 6.6426 7.5900 6.0576 4.9743 5.9357 5.6416 5.5968 4.6464 4.7408 2.0068 2.0469 1.8652 1.8258 1.7855 1.1315 1.1893 1.1492 1.7552 1.1393 1.6063 1.3054 1.5330 1.8653 2.0854 1.3923 1.3011 1.3032 1.2706 1.2712 1.3717 1.3658 1.4182 1.4454 1.3554 6.8306 15.0328 14.1075 14.9164 15.2377 1.2095 1.2085 1.2071 1.2072 1.2078 1.0487 1.0486 1.0486 1.0486 1.0487 1.0488 1.0486 1.0487 1.0490 1.0491 1.0414 1.0422 1.0425 1.0434 1.0430 1.0346 1.0346 1.0346 1.0346 1.0346 1.0982 1.0983 1.0984 1.0983 1.0983 1.0983 1.0982 1.0983 1.0983 1.0983
irintensity: 0.0827 0.3320 0.9345 0.4546 1.5375 2.3559 2.0353 2.2325 1.2571 0.0243 0.0612 0.0935 0.1748 0.4819 0.0950 0.0378 1.2342 0.2156 3.6326 0.9923 1.0680 2.9610 2.1826 40.9710 46.6505 37.4944 83.7344 23.3999 96.2007 14.3923 5.2679 11.0955 2.6753 2.0604 0.7866 0.4386 4.6581 15.3970 6.2355 0.2236 95.1229 136.2174 129.0233 96.4191 107.5795 61.7411 161.7848 155.7899 98.7311 0.1420 567.9404 570.7890 5.7458 217.7947 23.5286 25.4915 3.6250 3.8430 1.5989 38.9049 581.0525 643.3442 864.3416 738.8537 13.0419 52.3005 42.0007 120.3073 32.3464 14.5174 14.5394 3.1893 11.0061 7.5851 5.7490 6.3537 7.4344 8.5655 5.1727 24.0963 119.1078 25.3413 440.9357 195.1282 6.9446 6.1679 9.6377 7.4488 7.4838 13.1314 13.5289 16.7121 13.9707 6.5827 16.3918 12.6512 14.4861 10.1794 12.3504
temp: 298.150 k
press: 1.00000 atm
elementType: 14 14 14 14 14 8 8 8 8 8 6 6 6 6 6 1 1 1 1 1 1 1 1 1 1 1 1 1 1 1 1 1 1 1 1
symmnumber: 1
zpe: 661617.1 jmol-1
zpe.correction: 0.251997 hartree
zpe.thermalcorrener: 0.276601 hartree
zpe.thermalcorrenthalpy: 0.277545 hartree
zpe.thermalcorrgfe: 0.192969 hartree
zpe.sumelectzpe: -2024.713074 hartree
zpe.sumelectthermal: -2024.688470 hartree
zpe.sumelectthermalent: -2024.687526 hartree
zpe.sumelectthermalfe: -2024.772101 hartree
dipole: 0.2140 0.7141 0.7014
dipole: 1.0236
quadrupole: -119.9164 -124.7735 -127.2354
quadrupole: -0.1010 -0.0501 -0.9708
quadrupole: 4.0587 -0.7984 -3.2603 -0.1010 -0.0501 -0.9708
hfenergy: -2024.9650704 hartree
pointgroup: C01 [X(C5H20O5Si5)]
dipole: -0.1529596 0.2375223 -0.2870008 debye
polarizability: 190.9757967|2.8263991|182.6624812|1.8266191|-1.9838551|152.9397895 unknown
InChI: InChI=1S/C5H20O5Si5/c1-11-6-12(2)8-14(4)10-15(5)9-13(3)7-11/h11-15H,1-5H3
charge 0 multiplicity 1
35 atoms
Si 2.539387 -0.156192 0.96957
Si 0.872486 -2.631317 -0.515026
Si 1.022034 2.112831 -0.928821
Si -2.07195 -1.714036 0.811525
Si -1.998982 1.63372 0.449932
O  1.9739 -1.577931 0.23403
O  2.043691 1.204585 0.078213
O  -0.700249 -2.350415 0.051456
O  -0.58175 2.037381 -0.385815
O  -2.185559 -0.046082 0.53991
C  4.422668 -0.200062 1.015418
C  0.91689 -2.366049 -2.385108
C  1.603386 3.906576 -0.913161
C  -3.600398 -2.558185 0.096802
C  -3.468624 2.369587 -0.476548
H  1.910123 -0.05549 2.335555
H  1.254887 -4.025625 -0.104419
H  1.05314 1.490145 -2.302113
H  -1.920034 -1.922351 2.297532
H  -1.867031 2.154038 1.859522
H  4.824987 0.719298 1.475894
H  4.780444 -1.068205 1.596337
H  4.827975 -0.27953 -0.008324
H  0.647766 -1.323955 -2.634111
H  1.926246 -2.565937 -2.786623
H  0.201558 -3.037308 -2.89265
H  1.570009 4.309795 0.114137
H  2.642132 3.984631 -1.279383
H  0.958845 4.534797 -1.552851
H  -3.663281 -2.374265 -0.99008
H  -3.558214 -3.649568 0.260039
H  -4.521677 -2.170411 0.566297
H  -3.37015 3.46628 -0.560556
H  -3.524767 1.949481 -1.496077
H  -4.416591 2.143068 0.042698
