program: Gaussian 09
title: 000080039
version: EM64L-G09RevD.01
frameworkgroup: C1[X(C2H7O2PS)]
method: RPBEPBE
basis: SDD
operation: Freq
keyword: #p
keyword: freq=noraman
keyword: PBEPBE/SDD
title: #p freq=noraman PBEPBE/SDD
converged: YES YES NO NO
title: Mulliken charges:
elementType: S P O O C C H H H H H H H
charge: -0.245200 0.648888 -0.457928 -0.486325 -0.482734 -0.481648 0.071523 0.242139 0.251429 0.214903 0.233897 0.244200 0.246856
chargesum: 0.00000
title: Mulliken charges with hydrogens summed into heavy atoms:
elementType: S P O O C C
charge: -0.245200 0.720411 -0.457928 -0.486325 0.225737 0.243306
polarizability: 9.01146517e+01 8.30799643e+00 6.64058265e+01 6.03855637e+00 1.43307335e+00 5.00385567e+01
1716.lowfreq: -19.9795 -7.6624 -0.0021 -0.0009 0.0025 14.3570 73.6480 83.8396 101.1349
frequency: 73.6267 83.8068 101.0106 125.9685 156.9708 165.3489 263.0694 323.1418 389.4573 527.6991 635.7395 642.6430 843.0251 862.8194 950.8723 989.2397 1101.5065 1115.6446 1120.1851 1131.6866 1420.0570 1425.4542 1455.2934 1456.2138 1467.5386 1472.0840 2237.6336 2964.3454 2982.8799 3067.4429 3082.6088 3126.3019 3128.9283
redmass: 2.9558 1.8951 1.0599 1.5214 4.7553 4.1919 6.0405 5.0624 6.1209 8.6129 8.6546 6.5227 1.1528 1.3080 10.1757 4.6740 1.2488 1.2480 1.3058 1.3077 1.1202 1.1174 1.0507 1.0491 1.0532 1.0535 1.0399 1.0340 1.0301 1.1000 1.1051 1.1024 1.1027
irintensity: 3.5113 3.7376 0.1822 1.5669 1.6705 14.1788 18.8860 5.9398 7.4549 10.0200 97.2910 89.6183 85.7520 113.8478 157.8964 108.2295 0.5276 0.2013 0.6086 1.1304 2.1520 5.2243 15.0741 15.8143 18.9561 13.1330 67.6725 54.5536 41.0535 36.0758 29.0159 12.0193 13.0033
temp: 298.150 k
press: 1.00000 atm
elementType: 16 15 8 8 6 6 1 1 1 1 1 1 1
symmnumber: 1
zpe: 244578.0 jmol-1
zpe.correction: 0.093155 hartree
zpe.thermalcorrener: 0.102213 hartree
zpe.thermalcorrenthalpy: 0.103157 hartree
zpe.thermalcorrgfe: 0.058307 hartree
zpe.sumelectzpe: -969.597812 hartree
zpe.sumelectthermal: -969.588754 hartree
zpe.sumelectthermalent: -969.587809 hartree
zpe.sumelectthermalfe: -969.632659 hartree
dipole: 3.1182 2.2093 0.9614
dipole: 3.9406
quadrupole: -48.9466 -51.3188 -52.2278
quadrupole: -4.7019 0.8385 -5.3007
quadrupole: 1.8844 -0.4877 -1.3967 -4.7019 0.8385 -5.3007
hfenergy: -969.6909663 hartree
pointgroup: C01 [X(C2H7O2P1S1)]
dipole: -0.5606829 -1.342031 0.5368305 debye
dipolederiv: -0.4693635 -0.1443424 0.0545124 -0.0902202 -0.5890589 0.0604386 0.0330002 0.0904768 -0.3703742 1.809391 0.3126345 -0.0616619 0.1476474 1.8083722 -0.1343742 0.3440697 -0.0210679 0.9842296 -1.1948084 -0.3615763 0.0050029 -0.4468644 -0.800359 -0.0165251 -0.1055166 -0.0432699 -0.4277229 -0.9277871 0.2889012 0.1143522 0.368107 -1.0323542 -0.038165 0.0498248 -0.0705998 -0.5326499 0.4918506 0.123378 -0.0674211 0.2974063 0.44542 0.0238334 -0.2912835 -0.1047375 0.2178642 0.4761423 -0.2880952 -0.0494903 -0.0841718 0.3237534 0.07068 -0.2237575 0.2970453 0.3027969 -0.182519 -0.0084518 0.1108284 -0.0688257 -0.1448655 0.0969673 0.001675 -0.0574059 -0.2056489 0.0182623 0.0937323 -0.0031183 -0.0117243 -0.1312553 0.0164408 0.0514656 0.05276 0.0893048 -0.0602439 -0.0644019 -0.0938344 -0.0699121 0.0805678 -0.0025773 -0.0895741 0.0063017 0.0245393 0.0065404 -0.0267224 0.0572284 -0.0154038 0.012622 -0.090518 0.1735728 -0.027566 -0.1070025 0.0049141 0.0062631 -0.0814191 0.0078569 0.0614461 -0.0546641 0.0030307 -0.1298488 -0.1108313 0.0551956 0.0931548 -0.013821 0.1174689 -0.0475333 0.0637975 -0.007922 0.0598005 0.055611 -0.0275743 -0.0244739 0.0288417 -0.1513643 0.0132447 0.0046663 0.0614149 -0.0518884 0.0798839 unknown
polarizability: 75.5869583|13.8371414|79.6998794|-4.8479315|-7.9084654|51.2721972 unknown
InChI: InChI=1S/C2H7O2PS/c1-3-5(6)4-2/h5H,1-2H3
charge 0 multiplicity 1
13 atoms
S  1.237711 2.095786 -0.215975
P  0.097546 0.583026 0.569737
O  -1.250267 0.167824 -0.464722
O  0.880325 -0.940808 0.923355
C  -2.213638 -0.836655 0.043777
C  1.970328 -1.395539 0.032172
H  -0.50626 0.715631 1.869459
H  -1.730034 -1.821169 0.172609
H  -2.991405 -0.890952 -0.732292
H  -2.66627 -0.513181 1.002786
H  1.576459 -1.680495 -0.959951
H  2.39825 -2.273168 0.538729
H  2.734754 -0.6055 -0.082683
