program: Gaussian 09
title: 000080142
version: EM64L-G09RevD.01
frameworkgroup: C1[X(C10H25NO3Si)]
method: RPBEPBE
basis: SDD
operation: Freq
keyword: #p
keyword: freq=noraman
keyword: PBEPBE/SDD
title: #p freq=noraman PBEPBE/SDD
converged: YES YES NO NO
title: Mulliken charges:
elementType: Si O O O N C C C C C C C C C C H H H H H H H H H H H H H H H H H H H H H H H H H
charge: 1.540214 -0.601407 -0.581662 -0.588746 -0.296764 -0.918508 -0.331256 -0.345840 -0.195144 -0.217217 -0.212002 -0.660818 -0.655814 -0.655944 -0.625770 0.251034 0.249422 0.205658 0.227042 0.202741 0.171385 0.209256 0.196290 0.193896 0.202199 0.200131 0.195552 0.251955 0.222731 0.225695 0.199769 0.228053 0.230322 0.196527 0.228810 0.227700 0.195734 0.221648 0.188450 0.224678
chargesum: 0.00000
title: Mulliken charges with hydrogens summed into heavy atoms:
elementType: Si O O O N C C C C C C C C C C
charge: 1.540214 -0.601407 -0.581662 -0.588746 -0.044809 -0.418052 0.101444 0.028286 0.210402 0.178879 0.183680 -0.012623 -0.000912 -0.003701 0.009005
polarizability: 1.70229983e+02 8.84600994e-01 1.50133648e+02 3.08953365e+00 -9.07421446e-01 1.32971705e+02
1716.lowfreq: -11.4572 -3.5254 0.0011 0.0014 0.0015 9.8156 16.5475 24.4776 30.3027
frequency: 3.8539 23.7597 30.2811 35.2071 36.9542 42.6085 47.8386 66.6381 68.3662 82.6461 96.0513 105.2752 125.0558 131.5820 162.8461 205.5885 216.1381 234.1934 240.3681 245.3664 253.4116 269.3454 280.1966 286.5381 322.1838 380.3387 416.9689 427.2299 471.1586 591.7440 656.3121 676.0581 703.0705 746.0956 778.5438 804.2088 804.9436 808.7575 824.3849 933.6493 942.4115 943.7492 960.0539 1007.0357 1014.1884 1056.5317 1057.7209 1063.6708 1080.2842 1092.1382 1101.6567 1101.8319 1103.1115 1121.5455 1136.8156 1137.1782 1137.8393 1162.9167 1190.8595 1234.5389 1256.0346 1259.5237 1263.3465 1271.1763 1286.5614 1319.1344 1361.6310 1363.0531 1368.5831 1371.6304 1391.1761 1391.8640 1392.4651 1431.4342 1435.2316 1448.2552 1456.2570 1456.3873 1457.5606 1465.4535 1473.2918 1476.6427 1476.9795 1478.1283 1488.1889 1489.4154 1491.3374 1494.3877 1497.4925 2831.4445 2866.3350 2938.6344 2942.2865 2956.2487 2972.0777 2984.9784 2988.6502 2989.7019 2989.9964 2990.8952 2992.8306 2993.7930 3010.5090 3010.8387 3028.0504 3051.9804 3073.3894 3085.8685 3087.1595 3087.3819 3100.7603 3103.1038 3104.4420 3445.5106
redmass: 3.3175 3.6870 3.1717 2.9041 2.3305 2.5957 1.9848 1.7660 1.9246 2.9504 3.4709 3.2156 1.9516 3.4312 3.2265 2.5228 3.8664 1.2026 1.4065 1.2424 1.3500 4.3402 2.7571 2.9289 3.1180 3.1900 4.1768 4.1379 4.3294 4.2898 1.3556 2.9767 4.9696 1.2982 4.5509 1.0982 1.0901 1.0953 1.3537 2.5888 2.5557 2.5146 2.1066 1.7493 2.2896 3.7131 4.5340 3.0241 4.9072 1.2235 2.1344 2.1268 2.1325 1.5951 1.4854 1.4867 1.4944 3.5305 1.4811 1.5113 1.2371 1.1319 1.1301 1.1212 1.0853 1.3404 1.2446 1.2512 1.3927 1.2607 1.2589 1.2580 1.2587 1.0823 1.1498 1.2000 1.0411 1.0410 1.0417 1.0710 1.0700 1.0505 1.0507 1.0475 1.0679 1.0784 1.0793 1.0821 1.0688 1.0713 1.0569 1.0565 1.0557 1.0563 1.0651 1.0674 1.0363 1.0364 1.0387 1.0734 1.1039 1.1067 1.0746 1.1069 1.0989 1.1012 1.0993 1.0984 1.0983 1.0983 1.1014 1.1013 1.1014 1.0744
irintensity: 1.8946 1.0837 0.1839 1.1509 1.5667 0.2981 1.5152 4.2036 2.3234 0.8857 6.9964 3.6984 2.7662 2.3971 6.7232 0.4462 2.5093 1.3353 3.1676 1.3518 2.3847 9.2782 15.3063 13.7837 9.9988 0.8993 20.5314 19.4729 27.5732 8.3048 137.1498 15.4613 85.9397 41.1403 59.9362 3.2269 2.8855 2.1372 13.5827 81.7589 69.5334 148.1367 6.0393 23.8284 44.7152 204.1741 514.4714 65.8824 56.4879 14.6645 10.2086 8.9843 4.6895 15.8882 5.2549 5.5343 15.2956 28.1699 13.8691 27.4785 6.7528 0.6861 1.7197 1.1842 0.8847 3.8477 7.5315 18.3905 6.5901 5.0751 20.7081 29.5333 37.8126 18.6528 1.3118 20.0703 0.3859 20.7842 10.2023 9.4518 4.3660 8.4357 4.1151 4.2423 18.1290 8.1987 1.0683 0.7494 6.7252 93.3224 176.7460 53.8829 61.4992 53.2394 5.4008 7.3364 33.6799 37.0125 20.0742 53.0197 23.4714 73.5092 46.9493 38.2123 4.8691 52.8102 40.0197 38.5089 52.7693 21.9482 42.5695 35.0638 40.8548 1.2025
temp: 298.150 k
press: 1.00000 atm
elementType: 14 8 8 8 7 6 6 6 6 6 6 6 6 6 6 1 1 1 1 1 1 1 1 1 1 1 1 1 1 1 1 1 1 1 1 1 1 1 1 1
symmnumber: 1
zpe: 907495.1 jmol-1
zpe.correction: 0.345647 hartree
zpe.thermalcorrener: 0.368218 hartree
zpe.thermalcorrenthalpy: 0.369163 hartree
zpe.thermalcorrgfe: 0.287396 hartree
zpe.sumelectzpe: -964.652925 hartree
zpe.sumelectthermal: -964.630353 hartree
zpe.sumelectthermalent: -964.629409 hartree
zpe.sumelectthermalfe: -964.711175 hartree
dipole: 0.1341 -0.7269 -1.7136
dipole: 1.8662
quadrupole: -93.1319 -91.0614 -108.1016
quadrupole: -3.2572 -0.3378 -1.2571
quadrupole: 4.2997 6.3702 -10.6699 -3.2572 -0.3378 -1.2571
hfenergy: -964.9985716 hartree
pointgroup: C01[X(C10H25N1O3Si1)]
dipole: -0.0644712 -0.3047892 0.6648665 debye
polarizability: 170.0433373|-2.6192709|150.3476787|2.40417|1.3231582|132.9443199 unknown
InChI: InChI=1S/C10H25NO3Si/c1-5-12-15(13-6-2,14-7-3)10-8-9-11-4/h11H,5-10H2,1-4H3
charge 0 multiplicity 1
40 atoms
Si 0.808863 -0.084129 0.079719
O  2.069706 -0.229896 1.250104
O  1.055944 1.264359 -0.962572
O  0.842942 -1.39364 -1.03874
N  -4.556826 0.130179 0.123388
C  -0.804926 0.007591 1.065064
C  -2.070897 0.067812 0.17292
C  -3.371532 0.057318 1.000725
C  3.513683 -0.183486 0.970595
C  0.748843 2.662854 -0.636085
C  1.101235 -2.799522 -0.707566
C  4.245431 0.055106 2.292046
C  0.805956 3.470919 -1.933122
C  1.423016 -3.536463 -2.0087
C  -5.849193 0.16084 0.83179
H  -0.845496 -0.878842 1.729549
H  -0.763618 0.88909 1.735282
H  -2.072862 -0.793008 -0.527643
H  -2.065768 0.978012 -0.457143
H  -3.388624 0.940066 1.6721
H  -3.374579 -0.846193 1.666746
H  3.731521 0.624165 0.242209
H  3.828347 -1.145731 0.516279
H  -0.259287 2.74016 -0.174151
H  1.489968 3.046234 0.095883
H  1.944545 -2.878839 0.010508
H  0.202494 -3.237701 -0.223962
H  -4.529866 -0.59785 -0.60317
H  3.938076 1.018495 2.734284
H  4.006529 -0.746622 3.012105
H  5.340086 0.071608 2.132336
H  1.806383 3.385332 -2.390865
H  0.063526 3.090235 -2.655034
H  0.596404 4.539111 -1.735096
H  0.583309 -3.439917 -2.718194
H  2.322172 -3.105267 -2.481123
H  1.60146 -4.610978 -1.814097
H  -6.675536 0.186679 0.099298
H  -6.021427 -0.70438 1.519823
H  -5.914799 1.082995 1.439312
