program: Gaussian 09
title: 000080004
version: EM64L-G09RevD.01
frameworkgroup: C1[X(C7H14O3)]
method: RPBEPBE
basis: SDD
operation: Freq
keyword: #pfreq=noraman
keyword: PBEPBE/SDD
title: #p freq=noraman PBEPBE/SDD
converged: YES YES NO NO
title: Mulliken charges:
elementType: O O O C C C C C C C H H H H H H H H H H H H H H
charge: -0.425752 -0.433561 -0.220672 0.262134 -0.413304 -0.459964 -0.419900 0.142938 -0.711815 -0.732298 0.230783 0.204210 0.222131 0.243156 0.195549 0.250911 0.222596 0.218709 0.232442 0.216016 0.226690 0.227557 0.341279 0.380164
chargesum: 0.00000
title: Mulliken charges with hydrogens summed into heavy atoms:
elementType: O O O C C C C C C C
charge: -0.084473 -0.053397 -0.220672 0.262134 0.021690 0.005323 0.026561 0.142938 -0.038068 -0.062035
polarizability: 8.90520867e+01 1.38642701e+00 8.07905952e+01 2.00901316e+00 -1.35656448e+00 8.14210338e+01
1716.lowfreq: -25.0052 -20.7031 -0.0006 0.0005 0.0009 5.4369 33.0751 53.1906 81.5384
frequency: 31.3968 53.0696 81.4687 100.0350 152.3316 180.8126 221.2632 229.1896 268.9377 301.9033 316.8722 338.8824 366.7178 378.7016 467.7415 482.3727 560.5358 595.5046 677.9420 718.9918 760.8546 772.0105 852.5430 918.3409 956.2789 973.1551 999.5722 1027.9945 1041.1272 1058.5549 1073.4651 1129.3510 1151.7336 1175.2879 1221.9115 1269.2737 1275.9793 1295.2796 1325.2420 1336.2865 1358.6165 1385.5004 1395.0066 1398.6963 1456.2926 1469.7278 1477.4053 1479.8276 1485.6491 1488.9543 1495.0394 1652.2477 2968.6753 2979.3690 2982.6014 2991.1228 3000.5320 3042.4820 3046.1205 3071.7434 3077.0072 3078.0822 3081.9704 3103.9496 3522.5230 3567.4147
redmass: 2.8812 7.5447 2.8547 2.1618 3.8230 1.7434 1.1344 3.9448 1.4088 1.8147 2.0993 1.4994 3.8516 4.0353 2.9404 3.6868 2.8426 1.3260 3.3422 2.6703 1.5148 1.3886 1.7691 2.4565 1.9422 1.8938 3.3168 1.7441 1.8219 2.6462 2.2596 1.4954 2.0956 2.6048 1.6601 1.6343 1.1635 1.4823 1.2864 1.3664 1.5894 1.2139 1.2128 1.2077 1.0710 1.0572 1.0657 1.0502 1.0476 1.0502 1.0718 9.1655 1.0677 1.0382 1.0360 1.0605 1.0654 1.0997 1.0961 1.0981 1.0995 1.0991 1.1003 1.0948 1.0641 1.0661
irintensity: 0.8170 0.6958 1.4856 0.4977 0.6335 2.7087 0.9100 2.3508 37.9825 20.6207 0.2755 87.8005 28.6138 1.8711 5.8659 12.3738 21.5552 113.5460 17.6349 23.4192 7.3362 13.3929 9.1942 23.6048 32.4549 69.3007 124.6124 16.3750 49.7870 51.8993 38.0306 26.8036 0.6447 9.5924 12.6950 10.1603 1.2103 12.0383 1.9320 6.3801 3.3574 12.4710 12.4177 16.4078 0.2511 3.5412 23.9547 10.1904 3.8869 10.5473 12.0017 219.4983 35.7123 28.5404 27.9371 49.6762 13.8577 3.7427 4.5545 50.4780 24.6272 75.0444 32.7344 12.7511 25.4435 5.7797
temp: 298.150 k
press: 1.00000 atm
elementType: 8 8 8 6 6 6 6 6 6 6 1 1 1 1 1 1 1 1 1 1 1 1 1 1
symmnumber: 1
zpe: 533507.4 jmol-1
zpe.correction: 0.203202 hartree
zpe.thermalcorrener: 0.215642 hartree
zpe.thermalcorrenthalpy: 0.216586 hartree
zpe.thermalcorrgfe: 0.164422 hartree
zpe.sumelectzpe: -499.985545 hartree
zpe.sumelectthermal: -499.973105 hartree
zpe.sumelectthermalent: -499.972161 hartree
zpe.sumelectthermalfe: -500.024325 hartree
dipole: 1.2714 1.9364 -1.2627
dipole: 2.6383
quadrupole: -53.3646 -66.6289 -66.7567
quadrupole: -0.4097 3.1064 -1.9505
quadrupole: 8.8855 -4.3788 -4.5067 -0.4097 3.1064 -1.9505
hfenergy: -500.1887473 hartree
pointgroup: C01 [X(C7H14O3)]
dipole: -0.8041874 -0.4536823 -0.4741727 debye
dipolederiv: -0.2038945 -0.0579527 -0.1467535 -0.0505833 -0.9244715 0.0332308 -0.163297 -0.0480435 -0.454146 -0.8569919 0.0987969 0.4913248 0.1051593 -0.4270243 -0.1128917 0.4189974 -0.0810655 -0.6430572 -0.6303965 0.0780847 -0.2267727 0.0729642 -0.2764681 0.0489416 0.0488511 -0.0074411 -0.9442008 -0.104727 0.006125 -0.1147509 0.0030326 -0.1204023 0.0335079 -0.1985777 0.1245563 -0.1580119 0.0853404 0.0178833 0.013623 0.0593782 0.0906745 0.0438821 0.0790389 0.062812 0.0855191 0.0868754 -0.0102385 -0.0138472 0.0000569 0.045654 0.0203915 -0.0254958 0.0132904 0.0142594 0.1900399 0.0560826 0.0689154 0.0155105 0.7112078 0.0310671 0.1282946 0.0296945 0.3386729 1.2568275 -0.2327586 -0.057937 -0.2302772 0.1802594 0.0217573 -0.1794295 0.032786 1.3091062 0.0800575 -0.0397388 -0.0042117 -0.0282114 -0.0661986 0.0379324 -0.0146043 0.0059932 0.0367524 -0.0784368 0.040166 -0.016231 0.0368765 0.0954373 -0.0120783 0.0185538 -0.0181347 0.0543942 0.0047478 0.0101975 0.1315829 0.0005258 0.0333463 -0.0028247 0.1011247 -0.0124127 -0.04887 -0.1067425 0.0415351 -0.1244357 0.0387999 0.0061834 0.041149 -0.1164522 0.0450614 0.0294795 0.0073123 -0.0437774 -0.0467622 -0.0416391 -0.0644098 -0.1254923 -0.0319308 -0.1003747 0.0224363 0.0403588 0.0059001 0.0105762 0.0058466 -0.0450778 0.1200865 0.0063382 0.1119683 0.0231464 -0.1332348 -0.001682 -0.164628 0.0212476 -0.0317671 -0.0058714 -0.1305121 -0.0117125 -0.0045223 0.0109533 0.0045955 0.1100812 -0.0119348 0.0523185 -0.046937 0.0706339 -0.035919 0.002907 -0.0434015 0.0024307 0.1172405 0.0324948 0.0914163 -0.0104734 0.1280226 0.0272278 -0.041266 0.0790323 -0.0599643 -0.037582 -0.0588634 -0.1029472 -0.104201 -0.0414299 -0.1381455 -0.0097934 -0.0869745 0.0732629 -0.0886656 0.0279503 0.0711 0.030389 -0.0825275 0.0565471 0.032076 0.0781624 -0.0222036 0.0003162 0.0163519 -0.0967946 0.1180093 -0.0430406 0.1392114 -0.0058158 0.0508031 -0.0596624 -0.0532656 -0.0973266 -0.0576822 -0.0869181 -0.0930802 -0.0881638 0.0177106 -0.0328273 0.0393006 0.1034361 0.0423857 0.0801104 -0.0323949 0.1490604 -0.046238 -0.0658456 0.0841124 0.0202302 0.1362534 0.0047474 0.3914042 -0.060383 0.1276069 -0.0869891 0.2056205 0.2230042 0.033387 -0.0875065 0.0355077 0.3641314 0.0201214 -0.156145 0.0254918 0.2034483 unknown
polarizability: 88.4157961|-2.4228457|81.3320393|-1.406194|2.1896165|81.5158803 unknown
InChI: InChI=1S/C7H14O3/c1-3-7(4-2,5-8)6(9)10/h8-9H,3-5H2,1-2H3
charge 0 multiplicity 1
24 atoms
O  0.386136 2.499992 -0.421387
O  2.177797 -0.491588 -0.548162
O  1.485128 -0.335859 1.654271
C  -0.16903 0.038085 -0.178211
C  -0.603096 -1.172408 -1.073433
C  -1.165469 0.322363 0.984851
C  -0.021364 1.278346 -1.119509
C  1.202581 -0.267153 0.438733
C  -0.756108 -2.516193 -0.329804
C  -2.603615 0.671146 0.544022
H  0.143457 -1.285896 -1.881781
H  -1.562863 -0.909995 -1.560242
H  -0.751543 1.134098 1.61426
H  -1.188588 -0.557494 1.651975
H  -0.976581 1.425922 -1.666116
H  0.782642 1.09599 -1.848709
H  -1.544778 -2.47416 0.442583
H  -1.02833 -3.316169 -1.04195
H  0.185436 -2.817307 0.165191
H  -2.648284 1.571974 -0.097223
H  -3.076632 -0.156633 -0.014826
H  -3.2318 0.870371 1.43099
H  -0.339768 2.7904 0.185924
H  3.053974 -0.654031 -0.105646
