program: Gaussian 09
title: 000079990
version: EM64L-G09RevD.01
frameworkgroup: C1[X(C10H14O2)]
method: RPBEPBE
basis: SDD
operation: Freq
keyword: #pfreq=noraman
keyword: PBEPBE/SDD
title: #p freq=noraman PBEPBE/SDD
converged: YES YES NO NO
title: Mulliken charges:
elementType: O O C C C C C C C C C C H H H H H H H H H H H H H H
charge: -0.307749 -0.302790 0.540113 -0.532056 -0.537929 0.226527 -0.411337 0.178050 -0.337096 -0.673414 -0.530406 -0.530087 0.210351 0.207789 0.255077 0.233030 0.246349 0.222178 0.215882 0.222341 0.254220 0.220981 0.227893 0.252545 0.221723 0.227816
chargesum: 0.00000
title: Mulliken charges with hydrogens summed into heavy atoms:
elementType: O O C C C C C C C C C C
charge: -0.307749 -0.302790 0.540113 -0.113916 -0.282852 0.226527 -0.178307 0.178050 -0.090746 -0.013014 0.172688 0.171997
polarizability: 1.56833774e+02 3.08322466e+00 1.14348171e+02 3.48031979e+00 -6.45175831e+00 7.45415745e+01
1716.lowfreq: -9.5207 -0.0005 0.0003 0.0005 6.3409 8.5263 20.7728 63.4163 96.2212
frequency: 20.3698 63.3999 96.1877 107.0432 137.6450 158.1912 163.6081 179.4740 214.0854 249.6703 300.8743 315.9109 344.3993 383.5960 438.4466 488.1287 506.4618 572.9174 648.7128 694.5631 710.3147 747.8066 785.9766 835.1773 861.9314 898.3066 944.3706 952.5497 961.0906 988.8213 1054.8659 1062.7154 1095.6795 1113.5206 1114.6274 1141.0142 1153.4119 1157.1026 1193.3216 1238.5038 1246.4270 1265.5920 1312.4994 1366.3055 1386.0211 1400.1383 1423.7263 1442.0576 1456.4231 1458.6249 1471.0508 1473.2791 1477.6803 1484.9090 1488.1429 1490.7948 1574.6445 1613.3642 2969.1867 2971.3509 2978.5021 2987.1642 3037.7359 3065.1571 3067.5669 3077.1718 3083.4689 3118.4220 3119.5178 3125.8226 3139.4623 3159.5903
redmass: 2.4484 3.1184 3.3716 2.7649 2.2611 1.2810 1.0849 2.4791 1.2886 4.8385 2.1907 3.6847 4.4348 5.1088 3.9767 3.3942 4.2718 4.8307 3.9639 4.2371 5.0607 3.3674 1.1835 1.4535 4.3571 1.5018 6.2333 1.4368 3.5945 2.5201 1.5433 2.0745 2.5387 1.2437 1.2420 1.4363 1.3286 1.5004 1.7976 1.3324 2.3046 1.7742 1.5888 6.5567 1.2043 2.2406 1.1773 1.3832 1.0545 1.0692 1.0430 1.1342 1.0641 1.9539 1.0560 1.2129 7.2467 6.7619 1.0308 1.0311 1.0348 1.0599 1.1017 1.1040 1.1037 1.1000 1.1012 1.1026 1.1028 1.0888 1.0916 1.0956
irintensity: 0.0749 4.0597 3.0039 6.8342 0.9062 0.1211 0.0668 6.9577 2.5314 9.0906 1.4422 1.9549 0.3099 0.2041 4.2554 6.5768 6.6240 9.1928 8.9537 6.9655 12.6841 2.8046 2.2335 35.4345 14.2507 16.6576 61.3279 7.3352 34.7562 24.4034 5.8891 15.3177 55.8089 11.6094 3.3813 4.4667 0.4568 7.0062 42.7082 12.8776 73.5286 34.5995 11.2194 8.5561 9.0102 16.4972 0.6743 16.7622 16.0872 5.4616 14.3836 8.3549 7.6517 75.5576 25.3629 45.4564 7.4773 6.3725 92.5576 57.0632 40.0541 35.7496 7.9149 31.6686 24.2918 60.3110 41.5678 25.9671 24.9426 13.9453 7.2533 8.9138
temp: 298.150 k
press: 1.00000 atm
elementType: 8 8 6 6 6 6 6 6 6 6 6 6 1 1 1 1 1 1 1 1 1 1 1 1 1 1
symmnumber: 1
zpe: 567189.0 jmol-1
zpe.correction: 0.216031 hartree
zpe.thermalcorrener: 0.229222 hartree
zpe.thermalcorrenthalpy: 0.230166 hartree
zpe.thermalcorrgfe: 0.175599 hartree
zpe.sumelectzpe: -538.953551 hartree
zpe.sumelectthermal: -538.940360 hartree
zpe.sumelectthermalent: -538.939416 hartree
zpe.sumelectthermalfe: -538.993983 hartree
dipole: -0.1069 0.2023 -0.0135
dipole: 0.2292
quadrupole: -61.9396 -68.4224 -75.2622
quadrupole: 1.6474 -0.6697 3.2227
quadrupole: 6.6018 0.1190 -6.7208 1.6474 -0.6697 3.2227
hfenergy: -539.1695821 hartree
pointgroup: C01 [X(C10H14O2)]
dipole: -0.0449848 -0.0774739 0.0102941 debye
dipolederiv: -0.9287372 0.5213594 0.1143337 0.4629167 -0.8597141 -0.1334268 0.0177667 -0.0501084 -0.3719527 -1.4142627 -0.1352011 -0.1555534 0.0030044 -0.3976917 -0.0231807 -0.024841 -0.0253965 -0.3655525 0.3126073 0.027818 -0.0357337 0.072605 -0.0125503 -0.0370665 -0.0475879 -0.0400818 -0.0700828 0.0326076 -0.0349321 -0.0171207 -0.083233 0.1278968 -0.015267 -0.1447414 -0.0212336 0.1219436 -0.2444636 0.0880544 -0.0040036 0.0582716 -0.0639243 -0.0928728 0.0372426 -0.1059093 -0.1184044 0.4935703 -0.4085325 -0.0445172 -0.6179851 0.6652619 0.0170273 0.2148 -0.1785086 -0.0236243 -0.1259147 -0.0260954 -0.0117797 -0.1255659 -0.015164 -0.0633681 0.0446403 -0.0753376 -0.1479025 1.0431772 0.1133626 0.0212532 0.258016 0.0228482 -0.0080975 -0.3028018 0.013768 -0.0615614 -0.1317003 -0.0605361 -0.0426023 0.0542872 0.0190737 -0.0760913 -0.1062491 -0.0709139 -0.0896638 -0.0226011 -0.0254812 -0.0331342 0.0023428 0.0597548 -0.0348067 0.0612751 -0.0219749 0.0115406 0.4452408 -0.2316925 -0.0800258 -0.1004645 0.387432 0.1474662 -0.2169835 0.3373637 0.3834251 0.5961323 0.079977 0.1553775 -0.0743164 0.2482554 0.0579974 0.3930976 0.1299768 0.3774182 0.0112853 -0.0043539 -0.0125606 -0.0501838 0.0058416 0.1266087 0.0413943 0.0807203 -0.1038911 -0.0229875 0.0409333 0.027375 0.1032992 -0.121959 -0.0886316 0.0123887 -0.0341947 0.0534992 0.0779427 -0.0512022 0.0325921 -0.0528298 -0.0198116 0.0719227 0.0354805 0.0719142 0.1141991 -0.0194011 0.1164387 -0.0157452 0.1121188 -0.0009405 0.0472538 -0.0036082 0.0513649 0.1270856 0.0654578 -0.0549609 0.041453 -0.0498669 -0.0267483 0.073266 0.0387566 0.0757653 0.1243749 0.1082871 -0.0334919 0.0221962 0.0028 0.0004409 0.1256713 -0.0086002 0.0771959 -0.0908759 -0.2675613 -0.0595109 0.0291483 -0.0699248 0.0893239 -0.0101835 0.0245873 -0.0088121 0.0660457 0.068553 0.1116343 0.0147674 0.0644897 -0.1072291 -0.0723475 0.0007547 -0.0350634 0.056694 0.0151017 -0.0290198 0.0672295 -0.1072353 0.0434792 0.0820486 0.0879969 0.0019505 0.0038357 -0.0400886 -0.0960062 -0.1115897 -0.0189461 0.006319 -0.0850637 0.0033263 -0.1622878 -0.0505323 -0.0090702 0.1428571 -0.0277464 0.145466 -0.0489427 0.0225353 -0.0461454 0.0509539 0.0513849 0.0939926 -0.0147818 0.0019886 0.0613173 -0.0398517 0.1061917 -0.0668909 0.0584247 0.0023525 0.037173 0.0679786 0.0253745 -0.0114156 -0.0722628 -0.136926 -0.1150658 -0.1273214 -0.0496876 -0.1743405 -0.0446149 0.0390234 -0.0389674 0.1108627 -0.0006591 0.0700073 0.0077459 0.0499322 unknown
polarizability: 156.4791204|-4.9699563|113.7490867|-4.0732226|-8.619052|75.4953123 unknown
InChI: InChI=1S/C10H14O2/c1-4-8-5-6-9(11-2)10(7-8)12-3/h5-7H,4H2,1-3H3
charge 0 multiplicity 1
26 atoms
O  1.396036 -1.639463 0.556171
O  2.348959 0.866286 -0.624428
C  -1.781609 0.31576 0.318198
C  -3.261641 0.11986 0.618909
C  -0.848387 -0.720081 0.572116
C  0.517706 -0.569326 0.254889
C  -1.309111 1.515883 -0.273408
C  0.985582 0.657249 -0.298629
C  0.060265 1.686123 -0.573498
C  -4.025541 -0.532709 -0.564922
C  2.071999 -2.230176 -0.622477
C  3.262345 0.864383 0.542253
H  -3.382286 -0.514959 1.517516
H  -3.728217 1.095899 0.852871
H  -1.168421 -1.670049 1.015607
H  -2.014359 2.328193 -0.486248
H  0.437998 2.616787 -1.009687
H  -3.949625 0.091137 -1.473951
H  -5.096543 -0.660699 -0.321837
H  -3.605064 -1.526298 -0.804191
H  2.647683 -1.464963 -1.173526
H  1.325118 -2.693268 -1.295209
H  2.742505 -3.004086 -0.218452
H  3.196468 -0.090535 1.094481
H  3.016525 1.705336 1.21831
H  4.271715 1.001618 0.124942
