program: Gaussian 09
title: 000080007
version: EM64L-G09RevD.01
frameworkgroup: C1[X(C12H12OSi)]
method: RPBEPBE
basis: SDD
operation: Freq
keyword: #p
keyword: freq=noraman
keyword: PBEPBE/SDD
title: #p freq=noraman PBEPBE/SDD
converged: YES YES NO NO
title: Mulliken charges:
elementType: Si O C C C C C C C C C C C C H H H H H H H H H H H H
charge: 1.072824 -0.763547 -0.238176 -0.166224 -0.285652 -0.331266 -0.289082 -0.279790 -0.230940 -0.226634 -0.223021 -0.230361 -0.231677 -0.229815 -0.085031 0.233026 0.237118 0.280347 0.244548 0.226847 0.229141 0.226902 0.230143 0.371790 0.227757 0.230773
chargesum: 0.00000
title: Mulliken charges with hydrogens summed into heavy atoms:
elementType: Si O C C C C C C C C C C C C
charge: 0.987794 -0.391757 -0.238176 -0.166224 -0.052626 -0.094148 -0.008735 -0.035242 -0.004094 0.002507 0.003881 -0.000218 -0.003920 0.000959
polarizability: 1.95930642e+02 -4.19076706e+00 1.31481834e+02 -1.95885032e+01 -2.82169015e+00 1.14452063e+02
1716.lowfreq: -12.4095 -8.7105 -6.6999 -0.0016 -0.0015 0.0006 13.8140 20.3592 43.1963
frequency: 11.4190 20.3079 43.1772 103.9841 137.9938 160.3812 199.8556 235.3836 257.0717 312.7861 384.2735 392.0063 392.9016 433.3769 472.7030 493.4555 614.1715 614.5724 669.0349 688.0083 703.8382 706.5475 709.4907 735.4669 748.8382 769.0432 821.6464 861.0110 864.7821 894.2076 927.7395 934.1441 980.5922 986.0120 987.2043 987.4685 1001.2503 1004.0768 1022.6540 1024.3470 1074.4719 1075.4518 1103.3404 1111.8350 1172.7269 1174.1548 1193.7501 1195.6041 1309.0585 1311.9131 1367.5122 1369.0931 1419.0907 1420.2934 1469.5044 1470.4212 1577.3243 1579.0951 1597.4085 1600.5344 2078.3189 3109.1024 3109.3829 3118.0882 3122.2552 3130.3621 3136.0150 3143.7219 3149.0576 3160.6660 3160.9972 3705.0679
redmass: 3.8229 4.0180 5.2829 4.4785 4.8085 4.2883 1.9928 3.2552 2.1132 6.2329 5.0881 2.7728 2.8243 6.1374 3.6560 4.0553 6.4530 6.4515 6.0298 4.0119 2.0148 2.0221 2.1573 1.5206 1.7101 1.4374 1.1823 1.2468 1.2472 1.5243 1.3659 1.3637 1.4072 1.4717 6.0486 4.8628 1.3184 1.3193 2.9264 2.7518 1.6807 1.6894 2.8003 2.9876 1.0566 1.0569 1.1258 1.1250 1.4029 1.3739 5.5443 6.0427 2.1212 2.1307 2.0489 2.0595 5.5332 5.6798 5.8243 5.8279 1.0411 1.0875 1.0876 1.0867 1.0864 1.0907 1.0917 1.0957 1.0956 1.1014 1.1014 1.0673
irintensity: 0.0143 0.2972 0.0337 0.3301 1.3922 7.3904 58.7905 19.2436 95.5108 2.2647 14.4348 0.6964 1.2693 26.8701 38.0492 38.0650 0.6718 0.1668 27.4211 14.8381 10.3729 93.0584 160.6331 131.3821 47.0734 56.2407 195.6865 0.4677 0.3149 75.2483 1.0994 0.9563 0.0797 0.0833 0.0812 0.5689 0.0056 0.1756 0.1870 2.3039 2.6442 3.6701 28.5680 69.1218 0.1615 0.1595 6.3267 0.3864 9.6672 3.2987 1.0251 0.7460 24.0155 12.6672 1.6988 7.5534 0.4337 0.2085 2.4251 0.2898 142.4334 7.3433 5.7092 2.3342 1.2831 4.8416 22.3622 40.4024 22.2292 50.8718 12.8184 41.3640
temp: 298.150 k
press: 1.00000 atm
elementType: 14 8 6 6 6 6 6 6 6 6 6 6 6 6 1 1 1 1 1 1 1 1 1 1 1 1
symmnumber: 1
zpe: 526493.5 jmol-1
zpe.correction: 0.200531 hartree
zpe.thermalcorrener: 0.213762 hartree
zpe.thermalcorrenthalpy: 0.214707 hartree
zpe.thermalcorrgfe: 0.157716 hartree
zpe.sumelectzpe: -828.128209 hartree
zpe.sumelectthermal: -828.114978 hartree
zpe.sumelectthermalent: -828.114033 hartree
zpe.sumelectthermalfe: -828.171024 hartree
dipole: 1.6729 -0.6050 -0.0321
dipole: 1.7792
quadrupole: -78.7557 -84.3608 -88.3601
quadrupole: 3.5237 -2.8539 -0.2597
quadrupole: 5.0698 -0.5353 -4.5346 3.5237 -2.8539 -0.2597
hfenergy: -828.32874 hartree
pointgroup: C01 [X(C12H12O1Si1)]
dipole: 0.6422671 0.2774084 -0.0229959 debye
dipolederiv: 2.0916288 0.0281188 -0.0303962 -0.0469732 1.5286085 -0.1939989 -0.0886119 -0.1186036 1.1702326 -0.7378649 -0.0546505 0.1168934 -0.0535803 -1.1428112 0.0489507 0.1441881 -0.0697558 -0.6631327 -0.3780167 -0.0294534 0.0193499 -0.0897866 -0.2807764 0.0302214 0.0793805 0.0316469 -0.2684885 -0.5037219 -0.0343361 0.0183466 0.0713668 -0.3494387 0.0522072 0.0212175 0.0582965 -0.3330433 -0.0510992 0.1276682 0.0609447 -0.038292 0.0282697 0.0034944 0.0313548 0.0773286 -0.0970484 -0.0639406 0.0656557 -0.0860236 0.0005498 -0.1102431 -0.0654958 0.1694579 0.0194698 0.0911403 -0.1299757 -0.0839276 0.0117002 0.1422265 0.0647321 0.0564932 0.0006978 -0.0105049 -0.1029054 -0.0396309 0.0163924 0.1539201 0.0360155 -0.0901579 0.0443704 -0.0383929 -0.0387913 0.0320333 -0.1214147 -0.0494421 0.0123766 -0.035646 0.1049847 0.0163421 0.0113935 0.0022818 -0.1316908 -0.0219918 0.0484259 0.1320177 0.0286197 -0.1110774 0.0454522 0.1026892 0.0409088 -0.0129046 -0.0129614 0.1158845 0.0938352 0.0685439 -0.0184641 0.0564831 0.0692148 0.0722371 -0.0874602 -0.1313392 0.0111314 -0.0458823 0.0058151 -0.124031 -0.0596099 -0.0238584 -0.0425557 0.1070089 0.0345926 -0.0591014 0.1037524 -0.0382664 -0.0093308 -0.00363 0.0931975 -0.0121782 -0.1007115 0.0457943 0.1098523 -0.0312445 0.1017156 -0.0936324 -0.035159 -0.0285093 -0.03137 -0.0105193 -0.4056961 0.0130034 -0.0453905 0.0258902 -0.2581442 0.0263693 -0.0010512 0.0319622 -0.349631 0.0274136 -0.0911915 -0.0825195 -0.0963804 0.0150843 -0.0398832 -0.0812099 -0.0557647 0.0821719 0.1083686 -0.0243307 0.0490341 -0.0086029 0.1127062 0.0533691 0.0142526 0.0353321 -0.090511 0.150813 0.0168102 -0.0061156 0.0058052 -0.0245634 -0.018203 0.0011608 -0.0120483 0.1301211 0.0362878 -0.0478138 -0.0978053 -0.0440299 0.10518 -0.0268434 -0.1046453 -0.0125755 0.0130379 0.0744216 0.0399655 -0.0318255 0.0686156 -0.1270252 -0.010774 -0.0353976 -0.0135037 0.1384488 -0.0359529 -0.0743719 -0.0987901 -0.082782 0.1264229 -0.0275712 -0.1123142 -0.0317427 -0.0099575 -0.0297594 -0.0770421 -0.0963081 -0.0883628 0.0051023 -0.065878 -0.1097479 -0.0619997 0.0974431 0.0755896 -0.0380365 0.0242312 -0.0468131 0.1278024 0.0517341 0.051195 0.0553525 -0.1127821 0.1553554 0.1062776 -0.0937385 0.1481104 0.3688268 -0.0028738 -0.1127991 0.0216763 0.3336001 -0.0707668 0.0740798 -0.1008984 0.0821429 0.0578898 0.0277176 -0.1092987 0.0271158 0.1040155 -0.066133 -0.1095683 0.0505358 -0.1159016 0.0940858 0.0367154 0.0564362 0.0377856 0.0715328 unknown
polarizability: 190.035499|17.351067|129.2726979|23.3876907|-5.1461706|122.5563414 unknown
InChI: InChI=1S/C12H12OSi/c13-14(11-7-3-1-4-8-11)12-9-5-2-6-10-12/h1-10,13-14H
charge 0 multiplicity 1
26 atoms
Si 0.006409 -1.073116 1.028802
O  -0.06134 -2.732662 0.506873
C  -1.571475 -0.345563 0.274825
C  1.580374 -0.179608 0.446514
C  -1.831258 1.051133 0.319043
C  2.585575 0.189228 1.381879
C  -2.52649 -1.199126 -0.339633
C  1.795661 0.115576 -0.929107
C  -3.019018 1.582495 -0.233314
C  3.77195 0.833218 0.959648
C  -3.713526 -0.668893 -0.895406
C  2.980158 0.756398 -1.355686
C  -3.963403 0.721975 -0.840882
C  3.971359 1.11558 -0.411359
H  0.023445 -1.00982 2.543309
H  -1.103249 1.733783 0.776787
H  2.441112 -0.021589 2.449848
H  -2.324484 -2.2751 -0.383215
H  1.030114 -0.149574 -1.669009
H  -3.205145 2.661849 -0.192568
H  4.534923 1.113393 1.69488
H  -4.440671 -1.339187 -1.368135
H  3.129147 0.978132 -2.418604
H  0.672918 -3.360267 0.682027
H  -4.884599 1.133171 -1.269957
H  4.889813 1.614277 -0.741858
