program: Gaussian 09
title: 000079979
version: EM64L-G09RevD.01
frameworkgroup: C1[X(C6H14O4S)]
method: RPBEPBE
basis: SDD
operation: Freq
keyword: #p
keyword: freq=noraman
keyword: PBEPBE/SDD
title: #p freq=noraman PBEPBE/SDD
converged: YES YES NO NO
title: Mulliken charges:
elementType: S O O O O C C C C C C H H H H H H H H H H H H H H
charge: 1.153196 -0.382542 -0.380622 -0.490312 -0.480825 -0.356572 -0.348384 -0.270551 -0.678547 -0.230724 -0.654072 0.220009 0.219768 0.200165 0.199862 0.232712 0.227331 0.214130 0.214238 0.221281 0.236376 0.234060 0.218336 0.241022 0.240664
chargesum: 0.00000
title: Mulliken charges with hydrogens summed into heavy atoms:
elementType: S O O O O C C C C C C
charge: 1.153196 -0.382542 -0.380622 -0.490312 -0.480825 0.083205 0.051643 0.189492 -0.028898 0.239712 0.045951
polarizability: 1.66998466e+02 4.19382606e+00 9.89727111e+01 -8.59825487e-02 3.29142170e-01 8.93954202e+01
1716.lowfreq: -50.8014 -4.8733 -0.0030 -0.0011 0.0011 7.3059 10.9048 14.0348 43.4234
frequency: -50.7669 12.8409 42.5033 49.4652 51.6272 92.1034 114.2630 121.0302 173.5318 213.3696 221.4602 232.2998 244.9117 265.8579 313.3792 332.1987 392.3637 396.9454 484.1675 581.5663 588.4403 749.7811 814.5963 817.0899 822.8348 859.8644 880.7197 912.0968 943.6514 971.0063 1004.3678 1030.4134 1072.1821 1097.3973 1111.8226 1132.2895 1143.6752 1209.5532 1244.9415 1273.9720 1277.7761 1285.0346 1343.4856 1348.6549 1360.9948 1392.1337 1393.7680 1452.3746 1469.8804 1474.6251 1476.6519 1477.5817 1482.3551 1488.3902 1491.5100 2976.0068 2979.0245 2986.6994 2995.3035 2999.3848 3006.3124 3021.8864 3049.4901 3064.4920 3072.6772 3079.1936 3083.5728 3094.6409 3117.3139
redmass: 4.3323 3.4266 2.3002 2.5395 3.4238 2.2536 2.0267 4.4360 5.0616 4.7457 1.9375 1.1250 2.1324 4.0043 5.2860 11.5682 6.1572 4.2559 6.0111 13.1135 9.1436 1.0737 3.4719 1.1274 1.0843 16.3634 3.6018 2.5021 1.1622 17.0501 2.5826 3.6792 2.4790 2.2492 2.4975 1.3801 1.3756 1.3954 1.1652 1.1897 1.2582 1.0728 1.4266 1.2634 1.3212 1.2121 1.2089 1.0393 1.0739 1.0621 1.0422 1.0493 1.0663 1.0813 1.0910 1.0568 1.0380 1.0551 1.0451 1.0464 1.0583 1.1010 1.1068 1.1095 1.1038 1.0995 1.1051 1.0974 1.1025
irintensity: 0.6204 4.4173 1.3155 0.2895 1.6749 2.2244 0.2214 5.4344 9.7792 2.8947 0.3200 0.0503 0.1395 0.3795 3.8787 19.7479 13.8615 17.5082 15.7402 173.3868 37.2171 9.9661 67.6062 0.0982 6.2531 81.8279 45.0766 23.7155 3.6730 99.8821 56.2207 2.2249 1.3526 93.4198 19.0549 4.4421 2.3009 0.0171 0.0601 0.9818 3.0400 0.2378 3.0428 9.4664 10.6683 16.9514 7.2741 13.9984 6.6235 0.2293 13.3629 11.6249 13.1425 12.7487 24.9830 26.9371 30.3316 36.3273 17.6597 32.5232 35.5220 8.1340 0.9339 10.9048 2.1916 43.2248 104.1929 19.1054 28.4769
temp: 298.150 k
press: 1.00000 atm
elementType: 16 8 8 8 8 6 6 6 6 6 6 1 1 1 1 1 1 1 1 1 1 1 1 1 1
symmnumber: 1
zpe: 524908.2 jmol-1
zpe.correction: 0.199927 hartree
zpe.thermalcorrener: 0.214389 hartree
zpe.thermalcorrenthalpy: 0.215333 hartree
zpe.thermalcorrgfe: 0.155664 hartree
zpe.sumelectzpe: -934.865840 hartree
zpe.sumelectthermal: -934.851377 hartree
zpe.sumelectthermalent: -934.850433 hartree
zpe.sumelectthermalfe: -934.910103 hartree
dipole: -0.6609 1.5406 0.2665
dipole: 1.6974
quadrupole: -51.4686 -80.4441 -80.2296
quadrupole: 6.0072 0.4617 0.2357
quadrupole: 19.2455 -9.7300 -9.5155 6.0072 0.4617 0.2357
hfenergy: -935.0657666 hartree
pointgroup: C01 [X(C6H14O4S1)]
dipole: 0.2488517 -0.6129056 0.0916098 debye
dipolederiv: 2.0441875 0.0718206 0.0074381 0.060194 1.4841132 -0.0385574 -0.0100943 -0.0067057 1.4353946 -0.9678277 -0.0182388 -0.0062486 0.0121173 -0.3938746 0.0082265 -0.0131475 -0.0010072 -0.4169436 -1.1088551 -0.1701701 0.0091622 -0.1901437 -0.4636814 0.012145 0.0254237 0.0054553 -0.422944 -0.6312833 -0.0019361 0.0085563 0.0230926 -0.5499742 -0.0517592 0.0433 -0.132344 -0.6166525 -0.6287771 0.0098691 -0.0173163 0.0376617 -0.5850273 0.0752086 -0.0429997 0.1414983 -0.5864468 -0.3147216 0.0490753 -0.0065871 -0.4251991 0.1216342 -0.0099782 -0.0889452 0.0015283 0.1507916 0.188512 0.0162132 0.0012214 0.3531852 0.0403633 -0.0150026 0.059031 -0.0239122 0.1782303 0.7256073 0.0491467 0.0094267 0.6064297 0.156699 -0.0223384 0.1097509 -0.0286135 0.3079898 -0.133747 0.0670688 0.0031136 -0.0966812 0.0586656 -0.0073147 -0.0266976 -0.0026519 0.0940276 0.9566968 0.1855806 -0.0111205 -0.3834848 0.049223 -0.0132167 -0.0895338 -0.0447084 0.3065551 -0.2765285 -0.1875223 -0.0015628 0.1149055 0.0492327 -0.0038949 0.0384011 0.0154 0.0637294 0.0837921 -0.0134578 -0.0121783 0.0011634 0.0243336 -0.0795757 -0.0117455 -0.0975589 -0.0874956 0.0830213 -0.0283671 0.0160521 -0.0147872 -0.0401872 0.0945818 0.023385 0.1097127 -0.0191232 0.0237301 0.016374 0.0152645 -0.0164665 0.0032812 -0.1069945 -0.0284162 -0.1288201 -0.1223846 0.0219256 0.0058982 -0.001728 -0.0373587 -0.0817961 0.119069 0.0292877 0.1440157 -0.036214 -0.0167134 0.0040225 0.0142544 -0.0873648 0.0302711 -0.0612141 -0.0388347 -0.0875475 -0.0747482 -0.0282439 -0.0037431 -0.0071283 -0.1002086 -0.0312342 0.077755 0.0138884 0.1103767 -0.0257474 0.0931488 -0.0315087 0.0474703 0.0280501 -0.0579544 0.1165648 0.0100244 0.138766 -0.037974 0.0971275 -0.0046015 -0.0375352 0.0372064 0.0218958 -0.0927336 0.017364 -0.119239 -0.1218346 -0.217829 -0.0528795 -0.0224374 -0.0502102 0.0368066 -0.0144067 -0.0236082 -0.0136044 0.1002192 -0.0378169 -0.0436996 -0.0096023 0.0656072 0.0339487 -0.0827812 0.0642599 -0.0833534 -0.07136 -0.0538522 -0.0277603 -0.0050625 0.0910591 -0.0082379 0.088778 -0.0511325 0.1053449 -0.0273232 -0.1621031 -0.0002012 0.0215551 -0.0465253 0.0435209 -0.0080786 0.0185589 -0.0090429 0.1217028 0.1379341 0.0397768 0.0509629 -0.0017459 0.0478808 -0.0671669 0.021305 -0.0948168 -0.0723911 0.1226159 0.0692404 -0.0659703 0.019504 0.0100973 0.0826847 -0.0488246 0.1018283 -0.0190576 unknown
polarizability: 167.1303082|2.9323105|98.8508376|0.0897059|-0.1307483|89.3854514 unknown
InChI: InChI=1S/C6H14O4S/c1-3-5-6-10-11(7,8)9-4-2/h3-6H2,1-2H3
charge 0 multiplicity 1
25 atoms
S  -1.16343 0.859591 0.012075
O  0.321272 -0.205523 -0.123036
O  -2.258953 -0.604532 -0.080147
O  -1.244744 1.551704 1.46619
O  -1.336156 1.789093 -1.291738
C  2.690041 -0.518054 -0.071286
C  4.102439 0.098215 0.096427
C  1.59783 0.551587 0.053774
C  5.21352 -0.966347 -0.027985
C  -3.70713 -0.253251 0.075918
C  -4.422908 -1.602236 -0.009669
H  2.607409 -1.007822 -1.059428
H  2.525439 -1.296405 0.6971
H  4.174734 0.596054 1.0841
H  4.256281 0.886286 -0.667708
H  1.612734 1.030343 1.051388
H  1.691499 1.318372 -0.739047
H  5.100488 -1.750858 0.743182
H  5.183219 -1.459133 -1.017466
H  6.213967 -0.513169 0.094231
H  -3.865246 0.235544 1.055071
H  -4.013276 0.426975 -0.740736
H  -5.51209 -1.442739 0.09722
H  -4.233061 -2.087537 -0.981281
H  -4.086279 -2.276859 0.79475
