program: Gaussian 09
title: 000080015
version: EM64L-G09RevD.01
frameworkgroup: C1[X(C7H12N4O10)]
method: RPBEPBE
basis: SDD
operation: Freq
keyword: #p
keyword: freq=noraman
keyword: PBEPBE/SDD
title: #p freq=noraman PBEPBE/SDD
converged: YES YES NO NO
title: Mulliken charges:
elementType: O O O O O O O O O O N N N N C C C C C C C H H H H H H H H H H H H
charge: -0.276877 -0.277223 -0.163088 -0.154646 -0.162868 -0.153660 -0.164727 -0.180897 -0.164326 -0.182321 0.103060 0.139999 0.103020 0.140722 0.252727 0.252115 -0.318669 -0.318206 -0.672869 -0.672597 -0.184791 0.299639 0.234709 0.298083 0.235330 0.275089 0.267725 0.226214 0.275850 0.267577 0.226308 0.224882 0.224717
chargesum: 0.00000
title: Mulliken charges with hydrogens summed into heavy atoms:
elementType: O O O O O O O O O O N N N N C C C C C C C
charge: -0.276877 -0.277223 -0.163088 -0.154646 -0.162868 -0.153660 -0.164727 -0.180897 -0.164326 -0.182321 0.103060 0.139999 0.103020 0.140722 0.252727 0.252115 0.215679 0.215207 0.096159 0.097138 0.264807
polarizability: 1.66212721e+02 8.60595098e-01 1.27612254e+02 1.35394331e+01 9.03043396e-01 1.46779940e+02
1716.lowfreq: -8.4966 -3.1023 -1.8754 -0.0010 -0.0001 0.0003 8.1534 17.8426 29.9526
frequency: 5.4237 17.6682 29.9150 37.5239 39.9946 41.2911 51.3700 57.3441 84.2520 123.4429 126.3298 156.7126 159.8985 203.7298 206.5500 210.5245 214.8226 252.3345 255.2297 273.8142 286.5662 321.8293 325.0299 335.1746 341.6597 356.4279 388.7817 389.3563 464.2479 473.6467 499.2691 531.4886 581.2404 594.1399 607.0726 675.2900 677.3056 714.5379 723.5762 753.6416 754.0200 778.2234 786.4986 875.7582 883.1773 916.4825 925.0575 950.2259 954.6233 991.3285 1058.8246 1084.4255 1091.1093 1112.3145 1119.3082 1120.6938 1177.1909 1178.3574 1211.5500 1212.1021 1226.0359 1226.2125 1242.7307 1273.8185 1278.9643 1360.2586 1367.2672 1374.3848 1391.4762 1393.2077 1417.4596 1418.8501 1430.5453 1433.7929 1449.9970 1454.5252 1459.4260 1463.0008 1463.1971 1465.5272 1472.0471 2994.8889 3001.6021 3001.9718 3015.0062 3015.4702 3075.0440 3077.4169 3078.1125 3116.2636 3116.4702 3139.7187 3140.8820
redmass: 9.1510 9.1468 10.6110 9.1580 13.6817 13.1385 14.9903 8.4829 10.3468 4.7955 4.4071 12.0248 10.4477 3.0249 1.2528 1.2953 2.7948 3.9404 4.1126 3.0882 3.8360 6.4373 5.9211 3.2715 2.4395 2.2879 12.5271 12.2548 7.0275 6.3610 5.7909 5.4445 8.3346 5.0270 4.8855 5.4789 5.7966 8.3901 8.5384 10.4227 10.4717 6.4252 5.5896 5.2042 4.5018 2.8900 2.8735 1.5747 1.4788 5.9190 7.0590 1.7077 1.8266 1.8899 1.8187 1.8605 10.8370 10.3417 1.4648 1.4811 10.8862 9.3959 1.3561 2.9481 2.1106 1.3011 1.3098 1.1856 1.2514 1.2522 6.5693 6.6017 6.4202 4.7903 1.0911 1.1400 1.1588 1.1395 1.1060 1.0794 1.1104 1.0530 1.0578 1.0578 1.0367 1.0368 1.1119 1.1078 1.1071 1.0988 1.0986 1.1014 1.1015
irintensity: 1.5544 1.1631 0.0056 1.0353 0.3223 0.0409 0.1889 1.1742 0.0131 0.3098 0.0963 6.1031 1.1101 27.4654 1.4935 8.4746 5.4322 4.4600 0.1616 5.4485 2.3034 0.5624 0.9691 0.1888 5.3054 9.1121 2.4399 1.7898 0.3265 7.3399 20.1527 1.5225 0.2247 3.8933 0.6969 2.1617 0.8044 16.8144 12.3829 20.6313 50.8004 48.0727 18.8414 0.4599 45.1525 6.1595 0.3804 17.6411 1.2839 359.2566 108.3067 21.2657 14.2985 12.1839 1.6121 1.5038 11.9123 223.9329 12.8119 13.9477 1.9530 75.9181 0.1973 16.8266 0.4515 10.5496 0.2946 45.5274 52.1772 64.3147 64.5546 65.1160 423.0934 2.2168 0.9386 0.9564 18.4016 49.6922 4.4483 6.8620 1.0880 65.0624 6.7248 24.8402 5.3873 5.3072 21.2491 3.3013 2.7383 3.3852 3.3097 0.8806 0.7654
temp: 298.150 k
press: 1.00000 atm
elementType: 8 8 8 8 8 8 8 8 8 8 7 7 7 7 6 6 6 6 6 6 6 1 1 1 1 1 1 1 1 1 1 1 1
symmnumber: 1
zpe: 589790.7 jmol-1
zpe.correction: 0.224639 hartree
zpe.thermalcorrener: 0.247337 hartree
zpe.thermalcorrenthalpy: 0.248281 hartree
zpe.thermalcorrgfe: 0.167277 hartree
zpe.sumelectzpe: -1243.154792 hartree
zpe.sumelectthermal: -1243.132095 hartree
zpe.sumelectthermalent: -1243.131151 hartree
zpe.sumelectthermalfe: -1243.212155 hartree
dipole: -0.0775 8.5695 -0.3493
dipole: 8.5770
quadrupole: -118.4585 -120.3466 -137.4659
quadrupole: -0.1385 -4.7184 -0.6346
quadrupole: 6.9651 5.0771 -12.0422 -0.1385 -4.7184 -0.6346
hfenergy: -1243.3794314 hartree
pointgroup: C01 [X(C7H12N4O10)]
dipole: -0.023599 3.253243 0.895947 debye
polarizability: 163.1887374|-3.8556781|129.088579|14.7871984|-5.6167061|148.3275997 unknown
InChI: InChI=1S/C7H12N4O10/c1-6(8(12)13,9(14)15)3-20-5-21-4-7(2,10(16)17)11(18)19/h3-5H2,1-2H3
charge 0 multiplicity 1
33 atoms
O  1.097363 1.639956 1.001258
O  -1.112472 1.934021 0.037435
O  4.237564 -1.612095 -0.519134
O  2.723367 -1.013838 2.4666
O  -4.246865 -1.636434 -0.395931
O  -2.680777 0.390337 -2.620747
O  3.128656 -0.31387 -2.038376
O  1.205602 -1.533315 0.845302
O  -3.152151 -1.325187 1.586009
O  -1.164449 -0.856425 -1.459879
N  3.443205 -0.663614 -0.84625
N  2.210711 -0.884333 1.30755
N  -3.456588 -1.000386 0.384232
N  -2.180734 -0.078467 -1.547088
C  2.847435 0.184578 0.32705
C  -2.851007 0.332637 -0.171101
C  1.70082 1.053984 -0.208521
C  -1.726676 0.806237 0.760415
C  3.979064 0.931996 1.020293
C  -3.97952 1.327579 -0.407307
C  -0.000347 2.551199 0.736242
H  0.970103 0.436657 -0.76012
H  2.102336 1.839174 -0.876949
H  -0.995686 -0.003426 0.931314
H  -2.150298 1.133158 1.729036
H  4.722938 0.229331 1.424599
H  3.558446 1.528782 1.844494
H  4.467231 1.609674 0.298421
H  -4.70065 0.935748 -1.139949
H  -3.549951 2.268085 -0.785821
H  -4.496825 1.527794 0.547145
H  -0.293356 2.910829 1.739941
H  0.303712 3.378734 0.068837
