program: Gaussian 09
title: 000079926
version: EM64L-G09RevD.01
frameworkgroup: C1[X(C8H16O)]
method: RPBEPBE
basis: SDD
operation: Freq
keyword: #pfreq=noraman
keyword: PBEPBE/SDD
title: #p freq=noraman PBEPBE/SDD
converged: YES YES NO NO
title: Mulliken charges:
elementType: O C C C C C C C C H H H H H H H H H H H H H H H H
charge: -0.463579 0.244267 -0.348289 -0.267685 -0.747294 -0.731704 0.357980 -0.788821 -0.800821 0.184216 0.192807 0.204400 0.256147 0.208502 0.198963 0.203242 0.227390 0.213936 0.214474 0.230221 0.210631 0.218455 0.221664 0.217863 0.343035
chargesum: 0.00000
title: Mulliken charges with hydrogens summed into heavy atoms:
elementType: O C C C C C C C C
charge: -0.120544 0.244267 0.028734 -0.063286 -0.083682 -0.087137 0.357980 -0.133494 -0.142839
polarizability: 1.08970010e+02 -3.25795380e+00 8.05290454e+01 4.48143274e+00 6.42393443e-01 8.47496452e+01
1716.lowfreq: -3.9573 -0.0010 -0.0010 -0.0004 8.1813 16.2536 58.0497 89.5437 117.9553
frequency: 57.9544 89.5109 117.9285 148.7839 164.3230 185.0938 187.5076 219.1130 240.7903 265.8528 313.1263 322.0238 341.8173 369.5536 425.7541 451.4964 535.7558 550.2347 761.1251 815.6133 829.9304 902.9590 927.0675 937.8775 947.3579 966.4135 993.0144 1002.0373 1017.6163 1075.3692 1081.8360 1118.9018 1178.0669 1189.1591 1198.6694 1264.4406 1284.2773 1366.9732 1369.6931 1379.3693 1388.6980 1399.4894 1406.1850 1453.6790 1459.0685 1461.7361 1465.4565 1469.9428 1475.3847 1478.7483 1486.3960 1490.7359 1686.1892 2927.9214 2955.3318 2962.8284 2973.8386 2977.6422 2996.1007 3024.6300 3027.9230 3063.2412 3069.7225 3078.3144 3084.2776 3086.8989 3097.7021 3110.5994 3580.9277
redmass: 2.3499 3.8229 1.3922 1.4016 1.1338 1.2872 1.4888 1.3407 2.8050 1.1469 2.6347 2.7273 2.3824 2.6564 2.2616 2.4829 2.6856 2.7222 3.4234 3.0398 1.4610 1.8254 1.8069 1.4789 1.5308 2.5619 1.2511 1.9553 1.4738 1.5429 1.6583 1.8358 1.3679 1.6716 2.5080 2.2059 2.1236 1.2349 1.2263 1.2675 1.3322 1.2444 1.2694 1.0567 1.0550 1.0579 1.0481 1.0621 1.0645 1.0586 1.0618 1.0606 6.8481 1.0592 1.0378 1.0399 1.0366 1.0366 1.1011 1.0970 1.0962 1.0987 1.0979 1.0948 1.0935 1.0980 1.0989 1.0937 1.0666
irintensity: 0.6478 2.0148 7.3178 43.7542 46.3143 56.6325 0.2690 0.6108 4.8654 0.6248 1.2908 1.7864 2.3164 0.3761 1.9732 12.3224 2.5031 3.6850 4.7821 2.1730 25.3647 2.1632 3.5084 5.8679 1.7374 48.9785 2.3667 29.0225 4.4848 22.1374 3.4725 18.1649 7.9040 22.9593 9.1317 4.3432 7.4862 3.4997 16.5681 9.6777 28.0629 13.1089 6.4455 1.5395 7.5068 11.4351 4.0652 15.3658 5.8260 3.6172 8.5625 25.3683 6.2676 74.7132 40.8696 57.2653 26.8286 49.1285 62.7266 3.2187 54.2785 3.1642 82.7970 12.2746 24.3548 56.8616 22.1142 34.6501 2.4434
temp: 298.150 k
press: 1.00000 atm
elementType: 8 6 6 6 6 6 6 6 6 1 1 1 1 1 1 1 1 1 1 1 1 1 1 1 1
symmnumber: 1
zpe: 578597.8 jmol-1
zpe.correction: 0.220376 hartree
zpe.thermalcorrener: 0.232686 hartree
zpe.thermalcorrenthalpy: 0.233630 hartree
zpe.thermalcorrgfe: 0.183170 hartree
zpe.sumelectzpe: -388.887684 hartree
zpe.sumelectthermal: -388.875375 hartree
zpe.sumelectthermalent: -388.874430 hartree
zpe.sumelectthermalfe: -388.924891 hartree
dipole: -0.1832 -0.1175 -1.9014
dipole: 1.9138
quadrupole: -55.4879 -57.1220 -55.0297
quadrupole: 0.1370 -2.6366 -3.5756
quadrupole: 0.3920 -1.2421 0.8502 0.1370 -2.6366 -3.5756
hfenergy: -389.1080604 hartree
pointgroup: C01 [X(C8H16O1)]
dipole: -0.0628963 -0.1300947 0.7389485 debye
dipolederiv: -0.5816812 0.0249585 0.0835077 0.0526748 -0.692148 -0.2731983 0.0962779 -0.3252901 -0.2905835 0.2025244 0.0159387 -0.061168 0.0084822 0.1181568 -0.0223359 -0.0636884 0.0313915 0.0573036 0.3355301 -0.0446294 -0.0176028 -0.0598902 0.5948626 0.1947362 -0.0467171 0.1876816 0.2678859 -0.0279234 0.0079738 0.0387853 -0.0404931 -0.281108 0.0308021 0.2206905 0.0385196 0.0090646 0.0183211 0.004848 0.0698365 -0.0088199 0.0170081 0.0029006 0.0454346 -0.0112151 -0.0410718 -0.0132667 0.0073903 0.0224913 0.0229829 -0.0345391 -0.0412966 -0.0032026 -0.0299851 0.0076617 0.2194702 0.060294 0.0243745 0.0720448 -0.125314 0.0039516 -0.0529657 -0.0090332 0.2590266 -0.0575335 -0.0295376 -0.0863989 -0.0347741 0.1044997 -0.0133395 -0.0214809 -0.0010251 -0.0370069 -0.0084453 -0.016913 0.0118933 -0.0043143 0.0930548 0.0010055 0.0015917 0.0031416 -0.1603096 -0.2196507 -0.041039 -0.1384767 -0.0135513 -0.0230441 -0.0715002 -0.1007807 -0.0754223 -0.0238547 -0.0264293 -0.0357282 0.1490516 -0.0540871 -0.0314042 0.020714 0.1343416 -0.0097044 -0.1319025 0.0246367 -0.0148311 -0.0072922 -0.0047439 0.1439816 -0.0046953 -0.0399292 -0.0064887 -0.157722 0.1024167 0.0048211 -0.000514 0.0217281 0.0041441 -0.1312857 0.0307164 -0.1082637 -0.0023893 0.0659878 0.0805296 -0.0472827 0.0498287 -0.091464 0.1303259 -0.0138204 0.1092085 0.0089799 -0.1762103 -0.0566098 -0.051895 -0.0527863 0.0827466 -0.0040463 -0.1263496 -0.0272981 0.0352114 -0.1827155 -0.081084 -0.1085045 -0.0460702 0.0648713 -0.0244475 -0.1021148 -0.045552 0.0507561 0.0805594 0.0712412 -0.0330247 0.0624906 -0.0878719 0.0557822 -0.0182856 0.1148836 0.0282878 0.0126108 0.0024258 0.1348226 -0.0057247 0.0746594 0.0369774 0.1286948 -0.0012419 -0.0969823 -0.02149 -0.0894375 -0.0118012 -0.1588481 -0.1146231 0.0205439 -0.0064287 0.0630805 0.0760158 0.0745379 -0.0087328 0.0893832 -0.0048538 0.0986594 0.0233688 -0.0063775 0.0101386 -0.1542959 -0.1162625 0.0941002 0.0058672 0.1603422 -0.018193 -0.0312073 0.0293506 -0.0693913 0.0720764 -0.0532967 -0.0065766 -0.1521817 -0.007108 0.0997539 -0.0100439 -0.1340149 -0.0082735 -0.0239241 -0.030616 0.1106462 0.072294 0.1445109 -0.0271474 -0.0753784 0.064907 -0.0121941 0.0403352 0.0155676 -0.1106457 0.0484433 -0.14741 -0.0871499 0.0797339 0.0461908 0.0127935 0.0569092 0.3633583 0.0505972 -0.0346081 0.0483899 0.1176084 0.1019326 -0.0620396 0.1695395 0.1505284 unknown
polarizability: 108.8771075|4.2109232|80.4678354|-3.8933471|-0.4403006|84.9037574 unknown
InChI: InChI=1S/C8H16O/c1-7(2)5-8(3,4)6-9/h5,9H,6H2,1-4H3
charge 0 multiplicity 1
25 atoms
O  1.5836 -1.926796 -0.206585
C  0.970977 0.441098 -0.033275
C  1.462042 -0.809055 0.744471
C  -0.413061 0.20847 -0.665871
C  1.982585 0.729545 -1.177875
C  0.976092 1.659859 0.936366
C  -1.633316 -0.001784 -0.092906
C  -2.862149 -0.197621 -0.971678
C  -1.936946 -0.082268 1.395386
H  2.451612 -0.581729 1.201126
H  0.747742 -1.060641 1.555336
H  -0.394775 0.204477 -1.766313
H  2.04965 -0.135225 -1.859005
H  1.668954 1.618321 -1.756509
H  2.992708 0.924551 -0.77039
H  2.000727 1.856814 1.307466
H  0.626842 2.562707 0.404226
H  0.31835 1.514328 1.810514
H  -3.318571 -1.193745 -0.801924
H  -2.616377 -0.113687 -2.044298
H  -3.644153 0.552994 -0.737852
H  -1.043665 -0.03356 2.035171
H  -2.617342 0.738746 1.699312
H  -2.46627 -1.028817 1.624698
H  1.764542 -2.76258 0.290309
