program: Gaussian 09
title: 000079952
version: EM64L-G09RevD.01
frameworkgroup: C1[X(C7H6ClNO5S)]
method: RPBEPBE
basis: SDD
operation: Freq
keyword: #p
keyword: freq=noraman
keyword: PBEPBE/SDD
title: #p freq=noraman PBEPBE/SDD
converged: YES YES NO NO
title: Mulliken charges:
elementType: Cl S O O O O O N C C C C C C C H H H H H H
charge: 0.026284 0.992269 -0.556748 -0.484384 -0.524201 -0.452659 -0.205625 -0.689771 -0.292295 0.600932 -0.193737 0.446759 -0.489974 -0.360257 0.112493 0.303859 0.292360 0.323419 0.370736 0.386185 0.394354
chargesum: 0.00000
title: Mulliken charges with hydrogens summed into heavy atoms:
elementType: Cl S O O O O O N C C C C C C C
charge: 0.026284 0.992269 -0.170563 -0.484384 -0.524201 -0.058305 -0.205625 0.004384 -0.292295 0.600932 0.110123 0.446759 -0.197614 -0.360257 0.112493
polarizability: 1.98748362e+02 6.72003074e+00 1.60184870e+02 -1.10666160e+00 9.01729934e-02 7.12511408e+01
1716.lowfreq: -2.7401 -0.0025 -0.0023 -0.0023 2.9716 7.2288 18.4153 39.4029 57.0860
frequency: 18.3970 39.1986 57.0818 108.2700 129.9921 164.6319 178.1674 182.5719 219.3683 235.4495 243.1840 279.9598 311.8159 325.3502 342.6293 363.0207 387.3370 408.3411 448.6503 470.3524 478.5848 541.3347 560.8548 561.4607 622.4848 629.6521 655.7383 681.3609 707.4370 736.8269 766.0284 818.4022 898.1898 923.4112 932.5111 952.0196 997.7386 1044.7762 1047.9517 1087.9099 1147.0142 1258.8139 1285.1449 1314.9788 1381.7194 1428.8033 1470.1301 1550.5458 1619.3846 1646.6733 1659.6945 3162.1404 3173.0160 3417.6722 3474.8866 3536.0674 3651.5916
redmass: 13.5033 9.6688 7.5132 6.1261 10.6034 6.5922 1.8971 12.1362 6.8336 7.6251 3.8859 3.5142 9.5313 7.6993 11.3954 5.9325 7.7182 8.7065 2.1111 1.5162 6.1972 6.5009 5.0315 2.1225 2.0639 5.1131 7.0867 1.2067 6.0373 4.9748 3.1258 13.2799 1.4772 1.8832 4.7284 13.5752 4.4972 3.6722 1.2241 1.6496 1.5419 1.3317 2.1734 3.3192 5.5343 5.6569 3.9668 7.1956 2.8815 1.6319 7.1374 1.0924 1.0913 1.0572 1.0661 1.0643 1.0940
irintensity: 0.8458 1.0778 0.7116 2.5494 0.5739 0.9385 40.3361 0.8722 3.8867 5.1585 16.5947 51.6517 10.4180 13.3324 4.5788 1.4059 32.3378 34.8960 60.5436 73.1619 10.5309 66.2127 98.1706 68.3124 128.2665 45.1912 50.3973 121.1751 10.7563 71.3077 0.8800 85.1797 7.7231 34.3115 44.7607 141.7557 89.1738 154.5248 56.9925 3.9604 131.2555 11.1047 31.9090 39.6233 39.7339 33.8452 148.5563 7.5042 18.3939 423.1601 105.7589 10.9365 3.7383 135.3045 49.3898 57.1802 72.3854
temp: 298.150 k
press: 1.00000 atm
elementType: 17 16 8 8 8 8 8 7 6 6 6 6 6 6 6 1 1 1 1 1 1
symmnumber: 1
zpe: 339360.9 jmol-1
zpe.correction: 0.129256 hartree
zpe.thermalcorrener: 0.144622 hartree
zpe.thermalcorrenthalpy: 0.145566 hartree
zpe.thermalcorrgfe: 0.085237 hartree
zpe.sumelectzpe: -1558.063719 hartree
zpe.sumelectthermal: -1558.048353 hartree
zpe.sumelectthermalent: -1558.047409 hartree
zpe.sumelectthermalfe: -1558.107738 hartree
dipole: -0.3795 4.7176 1.2150
dipole: 4.8863
quadrupole: -105.1156 -91.0903 -104.2349
quadrupole: -8.9640 8.9464 -2.0499
quadrupole: -4.9687 9.0566 -4.0880 -8.9640 8.9464 -2.0499
hfenergy: -1558.1929747 hartree
pointgroup: C01 [X(C7H6Cl1N1O5S1)]
dipole: -0.2649647 -1.86644 -0.3765869 debye
dipolederiv: -0.2068901 0.2537849 0.0027773 0.331247 -0.5669321 0.0025837 -0.0130172 0.0064748 -0.0033449 2.0884993 0.2428087 -0.1283094 0.2123451 1.2056402 -0.0199266 -0.378434 -0.1104007 1.6776682 -0.5498419 0.0001439 0.221077 0.0115362 -0.5135971 0.0282858 0.4095883 0.0886385 -1.0134084 -0.6667974 -0.0805399 0.0035912 -0.1565493 -0.5871024 -0.102964 0.0205808 -0.0199952 -0.4924069 -0.739353 0.0408257 -0.0178284 0.0605755 -0.6156736 0.1215641 0.0231487 0.0518172 -0.5227618 -0.5849346 -0.3717444 0.03341 -0.5282973 -1.1018553 0.0567341 0.0421018 0.0473145 -0.4306486 -0.9935699 0.1971991 -0.0081004 0.0601855 -0.6029059 0.0255921 -0.0023569 0.0272659 -0.2995554 -0.5652441 0.6296125 0.0095775 0.5093197 -1.0914505 0.0281852 0.0139831 -0.0420753 -0.6130415 -0.3299829 -0.2766406 0.0079693 0.3308095 -0.2281566 0.0094682 -0.1663554 -0.0380659 -0.2222572 0.1770221 -0.981708 0.0434676 -0.4383881 1.0026965 -0.0472172 0.024789 -0.0449406 0.1781973 0.0651091 0.4177583 -0.0117864 -0.3636129 -0.2237741 0.019319 0.0426471 0.0214947 0.0050821 -0.6038455 -0.1193272 0.0194187 0.2024241 0.2064531 -0.0161043 -0.0075665 -0.00975 0.1128997 -0.0218505 0.6038321 -0.0294354 -0.2648932 -0.2356047 0.0130716 0.0160556 0.0195131 -0.172626 0.0813303 -0.7787606 0.0248586 -0.3781993 0.6125451 0.0016198 0.029901 0.0003407 -0.1399639 1.8294256 0.2575592 -0.0295774 0.3543777 1.4100362 -0.0942371 -0.0288997 -0.0876384 0.2370806 0.1376882 -0.0384768 -0.00671 -0.0071194 0.096248 0.0032717 -0.0092814 -0.0082166 0.15335 0.114423 0.0209761 0.0006693 -0.0053832 0.0049602 0.0066834 -0.0049081 0.0153653 0.169447 0.1378275 -0.047746 -0.0041533 -0.0619826 0.2801719 0.0028926 -0.0102839 0.0119304 0.3686223 0.3438905 0.0241711 -0.033132 0.0225469 0.2801638 -0.018311 -0.0144375 0.0563866 0.3319476 0.1217092 -0.0546541 -0.0925479 -0.0463578 0.334225 -0.0234633 0.0269075 0.011282 0.2729976 0.1653851 0.060926 -0.0052359 0.1554159 0.3339122 0.0029522 -0.0141625 0.0032587 0.4027222 unknown
polarizability: 197.7964606|-8.8407199|160.7944778|-4.4414353|-3.8677604|71.593434 unknown
InChI: InChI=1S/C7H6ClNO5S/c8-4-2-6(15(12,13)14)5(9)1-3(4)7(10)11/h1-2,10,12H,9H2
charge 0 multiplicity 1
21 atoms
Cl -2.036415 2.727513 0.005693
S  2.898986 0.363167 -0.054986
O  3.027206 0.335143 -1.907301
O  3.309353 1.834874 0.466819
O  3.680556 -0.947171 0.517578
O  -3.563659 -1.666689 0.184566
O  -4.098196 0.581033 0.030154
N  1.265432 -2.364668 0.148864
C  1.060721 0.101122 0.033463
C  0.510173 -1.215254 0.094438
C  0.283814 1.270971 0.003177
C  -1.732778 -0.116444 0.075727
C  -0.916372 -1.266945 0.113024
C  -1.115457 1.17114 0.032366
C  -3.218844 -0.30318 0.09158
H  0.772864 2.249627 -0.029111
H  -1.41086 -2.240878 0.157991
H  0.806767 -3.271308 0.181183
H  2.28574 -2.303364 0.243909
H  3.977369 0.541536 -2.149887
H  -4.555401 -1.739025 0.186953
