program: Gaussian 09
title: 000079900
version: EM64L-G09RevD.01
frameworkgroup: C1[X(C10H13ClO2)]
method: RPBEPBE
basis: SDD
operation: Freq
keyword: #p
keyword: freq=noraman
keyword: PBEPBE/SDD
title: #p freq=noraman PBEPBE/SDD
converged: NO YES NO NO
title: Mulliken charges:
elementType: Cl O O C C C C C C C C C C H H H H H H H H H H H H H
charge: -0.060518 -0.298834 -0.441413 0.583963 0.591787 0.399360 -0.514886 -0.606245 -0.584962 -0.272024 -0.803191 -0.806020 -0.338429 0.258623 0.253751 0.227582 0.205250 0.245655 0.245911 0.224438 0.247510 0.246876 0.220954 0.206656 0.214015 0.354190
chargesum: 0.00000
title: Mulliken charges with hydrogens summed into heavy atoms:
elementType: Cl O O C C C C C C C C C C
charge: -0.060518 -0.298834 -0.087224 0.583963 0.591787 0.399360 -0.514886 -0.347622 -0.331210 0.160808 -0.087186 -0.090680 0.082242
polarizability: 1.78216956e+02 -3.65682791e+00 1.30620584e+02 -5.26980313e+00 7.51614447e-02 7.15277530e+01
1716.lowfreq: 0.0016 0.0019 0.0025 0.5151 6.8759 9.3794 39.7821 54.8259 93.7047
frequency: 39.7740 54.8038 93.7027 111.8627 115.8170 127.3646 143.7985 193.0394 231.2700 232.3415 263.6837 273.9686 315.4983 324.6727 391.7936 424.4578 478.8779 511.0122 519.0033 539.7150 572.9556 589.6124 649.7341 710.4681 834.8847 844.9133 873.7670 880.1410 954.6756 961.6619 988.7315 1018.7290 1034.9162 1038.8306 1045.7075 1047.8075 1057.1196 1089.8862 1161.4809 1189.0546 1216.1632 1247.4331 1314.8634 1331.8299 1366.2971 1375.9131 1384.4313 1401.0881 1402.5816 1416.6508 1427.7909 1457.4426 1460.2473 1460.4502 1461.1479 1477.6889 1485.2541 1595.2989 1609.6023 2967.0759 2975.7012 2985.9921 2987.2287 3038.0633 3066.9821 3067.4431 3083.4420 3093.4880 3097.6555 3157.2614 3161.1384 3558.8222
redmass: 7.3980 3.9498 4.5856 3.6298 1.0493 1.0564 3.6731 4.1381 4.2127 3.5854 2.4624 3.1962 3.5838 6.4944 4.0205 1.1980 3.3129 4.4961 3.1216 3.6257 5.0019 3.8170 4.2504 2.8936 2.6081 1.4830 1.5352 2.4623 2.5342 2.5768 2.3089 3.3289 2.7358 1.7716 1.5267 1.5345 3.0429 1.7284 1.7560 1.2066 1.1934 1.3748 4.0696 1.1970 1.8061 3.2424 1.3597 1.2996 1.2385 2.4843 2.5628 1.0926 1.0784 1.0521 1.0450 1.1904 1.2859 6.2784 7.3206 1.0551 1.0687 1.0367 1.0369 1.1064 1.0973 1.0972 1.0969 1.1000 1.0999 1.0921 1.0909 1.0656
irintensity: 0.5976 3.0089 0.4532 3.3523 0.9410 0.7890 7.5762 2.0406 0.8032 0.4438 3.5764 4.1629 3.0750 4.7901 2.6664 209.1855 5.5092 0.3214 0.0322 0.5734 5.7195 1.1266 29.4832 2.8501 24.2289 5.1837 22.1424 36.2326 11.9987 3.8953 54.3701 75.8403 61.5946 2.8383 9.5055 10.8856 49.5589 9.2781 180.1806 11.1377 18.6957 8.5384 102.1999 13.8929 2.2213 17.8016 20.4251 23.1775 10.9656 29.4151 7.2282 29.0467 7.6574 23.6808 5.7157 13.2549 90.8050 60.5299 44.6068 33.9787 49.6108 26.4365 15.1774 50.3175 13.5063 13.2433 30.3533 18.8346 17.9538 4.3407 10.4161 6.8039
temp: 298.150 k
press: 1.00000 atm
elementType: 17 8 8 6 6 6 6 6 6 6 6 6 6 1 1 1 1 1 1 1 1 1 1 1 1 1
symmnumber: 1
zpe: 544683.7 jmol-1
zpe.correction: 0.207459 hartree
zpe.thermalcorrener: 0.221608 hartree
zpe.thermalcorrenthalpy: 0.222553 hartree
zpe.thermalcorrgfe: 0.165810 hartree
zpe.sumelectzpe: -998.369904 hartree
zpe.sumelectthermal: -998.355754 hartree
zpe.sumelectthermalent: -998.354810 hartree
zpe.sumelectthermalfe: -998.411553 hartree
dipole: 0.0622 -1.1276 -1.2787
dipole: 1.7060
quadrupole: -99.5435 -73.6360 -87.6034
quadrupole: -5.9660 -7.5974 0.9120
quadrupole: -12.6159 13.2917 -0.6758 -5.9660 -7.5974 0.9120
hfenergy: -998.5773628 hartree
pointgroup: C01 [X(C10H13Cl1O2)]
dipole: -0.0342127 -0.46073 0.486868 debye
dipolederiv: -0.8203603 0.0292085 0.0356033 0.0490931 -0.1419736 -0.0076979 0.0390916 -0.0065553 -0.0733935 -2.0058052 -0.1830139 0.0414931 -0.1637974 -0.3584455 0.0044057 0.0480389 -0.0044795 -0.2910743 -0.4918084 0.2117219 0.0610636 0.3389144 -0.5289346 0.159665 -0.0147125 0.1285981 -0.6371692 0.0780153 0.1177676 0.00796 0.0977239 0.2808132 0.0128591 0.0065434 0.0110499 0.0437046 0.0094277 -0.0466964 0.0005715 -0.0970519 0.2966426 0.0218378 -0.00254 0.0193179 0.0607821 1.7010652 0.0637485 -0.047931 -0.1791628 0.1425867 0.0113376 -0.0960992 -0.0001332 0.1297259 0.9896238 -0.0922132 -0.0620592 -0.0638553 -0.2378353 -0.0024156 -0.0611572 -0.0001672 -0.1734504 -0.4379927 -0.0811469 -0.0029094 -0.2002981 -0.1020235 0.0198868 -0.010381 0.015099 -0.2176653 -0.3831727 0.0347345 0.0025133 0.2581066 -0.1619029 -0.0033412 0.0233805 0.0078267 -0.248979 0.6725048 0.2262273 -0.0179743 0.6368586 0.3557681 0.0015318 0.0372758 0.0122165 0.3132892 -0.0598296 -0.163567 -0.0075973 -0.1152381 -0.021748 0.0006068 -0.0028888 0.0027526 0.0489083 -0.016738 0.1595778 0.0147028 0.1174804 -0.0543643 -0.0133302 0.0124344 -0.0158001 0.0442024 0.3186266 -0.0634982 0.0099535 -0.1446724 0.4182496 -0.1596795 0.0136131 -0.1030959 0.5455213 0.0561864 0.0569011 0.009243 0.0678323 -0.0306719 -0.0183427 0.0105576 -0.0163731 0.1641487 0.0252167 -0.0784873 0.003126 -0.1100358 -0.0241707 -0.0095811 -0.0012792 -0.0097813 0.1617792 -0.0047009 0.029179 0.0598906 -0.1152689 -0.0260827 -0.0685725 0.0290561 -0.1090245 -0.0753856 -0.0191212 0.05226 -0.0747175 -0.1043564 -0.0579245 0.1029023 -0.0201485 0.1204286 -0.0763004 0.0141076 -0.0412249 -0.1051775 -0.0110352 0.0516276 0.0314891 -0.1087754 -0.0227856 -0.0172346 0.0342251 -0.0526872 0.0923778 -0.0295166 0.0508998 -0.0179244 0.1004055 0.0390829 -0.036273 0.0099463 0.1653124 0.0176461 0.0561344 -0.0706648 -0.0165007 0.009029 -0.021353 0.1067871 0.0446768 0.0388244 0.1000263 0.0154887 0.0424187 0.0142887 0.0957699 -0.0435983 -0.0391673 0.0239968 0.0584421 -0.1002637 0.0284984 0.037111 -0.0064721 -0.0993808 0.0487506 -0.014062 -0.0283703 -0.1741293 -0.005182 -0.0682999 -0.0382744 -0.0070327 0.0020084 -0.0013117 0.1064201 0.0646922 0.0193753 -0.0132842 0.0873422 -0.012813 -0.0913123 0.02867 -0.0443489 -0.1926436 -0.0503025 -0.1001286 0.0066144 -0.1010618 -0.0539416 0.0451898 -0.0434531 0.0045817 0.0722677 0.2758904 -0.1864874 -0.0256891 -0.2498224 0.2456535 -0.0037976 0.0049415 -0.0108967 0.2952613 unknown
polarizability: 178.3826644|3.7191437|130.5421351|-3.1726371|2.0462284|71.4404934 unknown
InChI: InChI=1S/C10H13ClO2/c1-7-5-9(13-4-3-12)6-8(2)10(7)11/h5-6,12H,3-4H2,1-2H3
charge 0 multiplicity 1
26 atoms
Cl 4.025134 -0.169608 -0.139648
O  -1.969534 0.373352 0.191317
O  -4.560069 0.570381 -1.020888
C  1.620864 1.253194 0.081239
C  1.434836 -1.228971 -0.090683
C  -0.581502 0.161529 0.10715
C  2.193366 -0.038739 -0.041425
C  0.21278 1.330381 0.15507
C  0.022073 -1.110929 -0.012638
C  -2.860891 -0.803809 0.136314
C  2.466067 2.508684 0.133822
C  2.080876 -2.593162 -0.222093
C  -4.279053 -0.236952 0.167186
H  -0.282459 2.301299 0.253449
H  -0.578103 -2.02457 -0.0479
H  -2.686707 -1.359242 -0.806663
H  -2.669618 -1.466719 1.004631
H  3.168136 2.481934 0.987017
H  3.081276 2.6143 -0.778264
H  1.832423 3.405383 0.232278
H  2.680554 -2.663749 -1.147847
H  2.772137 -2.791212 0.617241
H  1.319558 -3.390661 -0.240536
H  -4.422424 0.352495 1.096615
H  -5.013203 -1.05974 0.148898
H  -3.849119 1.258534 -1.086443
