program: Gaussian 09
title: 000079885
version: EM64L-G09RevD.01
frameworkgroup: C1[X(C9H22N2O)]
method: RPBEPBE
basis: SDD
operation: Freq
keyword: #p
keyword: freq=noraman
keyword: PBEPBE/SDD
title: #p freq=noraman PBEPBE/SDD
converged: YES YES NO NO
title: Mulliken charges:
elementType: O N N C C C C C C C C C H H H H H H H H H H H H H H H H H H H H H H
charge: -0.317656 -0.086162 -0.107996 0.347846 -0.009522 -0.719437 -0.711808 -0.690266 -0.628980 -0.606861 -0.608245 -0.635154 0.207681 0.230841 0.216312 0.208568 0.224796 0.223722 0.196391 0.249985 0.200139 0.214460 0.231657 0.211275 0.220558 0.210794 0.208848 0.217991 0.209906 0.217335 0.214499 0.214167 0.187986 0.256330
chargesum: 0.00000
title: Mulliken charges with hydrogens summed into heavy atoms:
elementType: O N N C C C C C C C C C
charge: -0.317656 -0.086162 -0.107996 0.347846 0.198159 -0.063716 -0.066899 -0.025682 0.034510 0.030772 0.033494 0.023330
polarizability: 1.29120567e+02 -1.26183455e-01 1.19931008e+02 -1.42546595e+00 -1.55106010e+00 1.04749879e+02
1716.lowfreq: -28.5513 -14.0422 -0.0008 -0.0006 -0.0004 11.0651 12.6476 57.1976 78.5180
frequency: -26.1654 57.0480 78.4176 89.1150 132.8616 152.2788 164.7888 195.6712 200.8955 216.3581 221.2890 221.7685 229.8968 244.6654 266.1245 277.4948 294.3337 336.2499 349.3403 371.4382 381.7841 424.3448 451.9122 495.6872 536.3632 570.5188 744.1693 814.0427 846.7373 878.8519 891.9235 901.9879 918.4536 946.1287 1004.4864 1018.7772 1028.2172 1035.4665 1045.7960 1056.2243 1084.0489 1097.3282 1136.0711 1142.3059 1182.8114 1190.8449 1224.8841 1239.4138 1258.1341 1267.0044 1304.8675 1315.0902 1369.5744 1372.9701 1375.2809 1396.9389 1411.9173 1416.3645 1435.4552 1438.6640 1442.6787 1453.5411 1457.0790 1461.4075 1461.6920 1463.0352 1470.6035 1472.7067 1478.6568 1483.1428 1486.9776 1492.4479 1495.9351 1507.5888 2881.8378 2902.9948 2904.3291 2924.1444 2939.8260 2978.8425 2979.9043 2982.1394 2988.2540 3000.5405 3015.8954 3030.6924 3057.0901 3066.9964 3073.1421 3076.2698 3084.7810 3091.5736 3092.3347 3095.1236 3099.1054 3103.9044
redmass: 2.7087 2.5118 2.8086 2.8012 2.0674 2.0060 1.1759 1.4641 1.0811 1.4422 1.2607 1.0499 1.1020 1.5216 2.3424 2.3649 2.4821 2.6950 2.4219 2.5603 2.4547 2.4379 2.8280 3.2970 3.5636 4.0123 4.3427 3.8473 3.8131 4.3129 4.1869 1.6665 1.7194 1.2153 2.2633 1.4330 1.5263 1.6649 1.7769 1.4184 1.2668 1.2481 1.3776 1.4521 2.1869 2.8584 2.8294 2.9359 2.8372 2.7558 2.5723 1.5570 1.2423 1.2835 1.2342 1.2106 1.1398 1.1280 1.1367 1.1619 1.0590 1.0477 1.0535 1.0592 1.0530 1.0545 1.0531 1.0555 1.0567 1.0521 1.0606 1.0542 1.0542 1.0703 1.0532 1.0488 1.0491 1.0491 1.0829 1.0473 1.0692 1.0362 1.0356 1.0826 1.0815 1.0862 1.0998 1.1004 1.0987 1.0991 1.1006 1.0993 1.0997 1.0995 1.0932 1.0958
irintensity: 0.0585 0.2661 2.0743 0.1126 4.3191 3.9005 0.4927 0.4823 1.8622 0.5248 1.4878 0.4454 0.9079 0.7843 2.8755 3.8918 2.5862 8.6985 0.6394 11.1994 6.6211 2.5422 3.7813 10.7466 3.4746 0.9287 1.2604 70.5166 51.7545 99.1957 115.9690 3.5249 34.8051 2.2712 81.3542 1.4698 13.5065 115.9867 59.3406 16.1543 3.3919 5.3755 0.4574 1.5408 109.5274 1.1519 16.9501 23.3196 19.8920 40.5050 44.9106 24.8216 29.8849 1.3501 33.5115 25.2604 1.5721 13.6475 2.6495 15.6014 1.1930 15.3611 3.8037 6.7576 10.7742 15.0459 7.3700 1.7699 9.2272 18.9536 16.4254 26.0350 10.4561 12.6133 109.9934 49.9499 172.6358 97.3716 37.8670 0.9282 95.0133 27.9800 26.6118 49.2597 48.7929 48.1875 38.8297 47.8837 15.0178 33.1202 4.2290 65.9398 30.8685 43.1841 12.8588 25.6923
temp: 298.150 k
press: 1.00000 atm
elementType: 8 7 7 6 6 6 6 6 6 6 6 6 1 1 1 1 1 1 1 1 1 1 1 1 1 1 1 1 1 1 1 1 1 1
symmnumber: 1
zpe: 794015.9 jmol-1
zpe.correction: 0.302425 hartree
zpe.thermalcorrener: 0.318204 hartree
zpe.thermalcorrenthalpy: 0.319148 hartree
zpe.thermalcorrgfe: 0.261385 hartree
zpe.sumelectzpe: -539.808443 hartree
zpe.sumelectthermal: -539.792664 hartree
zpe.sumelectthermalent: -539.791720 hartree
zpe.sumelectthermalfe: -539.849483 hartree
dipole: 0.4837 0.0751 -0.5053
dipole: 0.7036
quadrupole: -75.0283 -75.4061 -76.6957
quadrupole: 0.3745 -1.9266 -0.8744
quadrupole: 0.6817 0.3040 -0.9857 0.3745 -1.9266 -0.8744
hfenergy: -540.1108678 hartree
pointgroup: C01 [X(C9H22N2O1)]
dipole: 0.185667 0.0029588 0.2052754 debye
polarizability: 128.9794665|-0.886289|117.8167557|1.2870419|-5.7235328|107.0052311 unknown
InChI: InChI=1S/C9H22N2O/c1-9(2,3)12-8(10(4)5)11(6)7/h8H,1-7H3
charge 0 multiplicity 1
34 atoms
O  0.504915 -0.432608 -0.454884
N  -1.736886 -0.799394 0.33722
N  -0.936878 1.48708 -0.19845
C  1.914423 -0.195455 0.011086
C  -0.618626 0.155628 0.320195
C  2.12319 -0.798791 1.422187
C  2.743487 -0.971644 -1.030429
C  2.265588 1.309273 -0.008705
C  -2.316831 -1.154208 -0.975208
C  -1.490583 -1.981387 1.187167
C  -1.961808 2.217844 0.554306
C  -0.878655 1.774238 -1.636763
H  -0.318319 0.277025 1.384194
H  1.741599 -1.834684 1.451699
H  3.200456 -0.815979 1.669194
H  1.613808 -0.211798 2.207922
H  2.525377 -0.594324 -2.044656
H  2.492067 -2.0464 -1.000917
H  3.824596 -0.853009 -0.833732
H  1.556579 1.887829 0.607613
H  3.291067 1.466659 0.376133
H  2.214156 1.705815 -1.03801
H  -2.590536 -0.241064 -1.526137
H  -3.239792 -1.740213 -0.810389
H  -1.627057 -1.755448 -1.60912
H  -1.117063 -1.658051 2.176288
H  -0.74708 -2.688016 0.750108
H  -2.439841 -2.526501 1.342629
H  -1.874673 3.301487 0.343959
H  -1.812933 2.063595 1.639414
H  -3.002575 1.897901 0.315452
H  -0.512434 2.808275 -1.800237
H  -1.864026 1.688518 -2.154207
H  -0.173313 1.073613 -2.110621
