program: Gaussian 09
title: 000079874
version: EM64L-G09RevD.01
frameworkgroup: C1[X(C8H6Cl2O2)]
method: RPBEPBE
basis: SDD
operation: Freq
keyword: #p
keyword: freq=noraman
keyword: PBEPBE/SDD
title: #p freq=noraman PBEPBE/SDD
converged: NO NO NO NO
title: Mulliken charges:
elementType: Cl Cl O O C C C C C C C C H H H H H H
charge: -0.013949 -0.007063 -0.413798 -0.210956 0.536806 -0.664936 -0.360503 -0.386127 -0.059049 -0.194816 -0.103482 0.197568 0.268441 0.266781 0.261857 0.241827 0.259377 0.382022
chargesum: 0.00000
title: Mulliken charges with hydrogens summed into heavy atoms:
elementType: Cl Cl O O C C C C C C C C
charge: -0.013949 -0.007063 -0.031777 -0.210956 0.536806 -0.129714 -0.098646 -0.144300 -0.059049 0.064561 -0.103482 0.197568
polarizability: 1.54626022e+02 -3.46431621e+00 1.05827443e+02 -1.41996872e+01 -4.09539003e-01 6.26046101e+01
1716.lowfreq: -9.3274 -0.0026 -0.0023 -0.0018 6.0869 7.3425 15.4404 24.4526 58.5189
frequency: -5.8447 24.2932 58.5141 125.9366 181.8866 191.3250 230.8922 291.5728 316.9813 364.9635 430.7863 437.3698 460.7819 496.9612 535.7211 589.5164 642.6908 655.9666 680.8775 715.8624 806.5524 845.7465 876.6011 897.6826 930.6212 954.8789 1003.7373 1043.8466 1118.5318 1143.2954 1174.7419 1212.2822 1247.9343 1264.6215 1333.3524 1371.2960 1387.2327 1445.6592 1464.5878 1574.6547 1602.3713 1672.5217 3006.0595 3058.8477 3140.1555 3153.8396 3170.5646 3509.2280
redmass: 8.6662 6.7347 10.5244 6.5269 19.8503 8.0089 3.4037 10.4779 6.8333 4.5021 4.8876 3.1750 6.6758 2.2272 5.6216 4.6996 1.3833 5.8819 5.5606 3.9679 1.8488 1.9572 4.4587 1.7514 2.2136 1.3671 5.3485 2.6595 2.0796 1.5291 1.1446 1.7294 1.4664 1.8302 2.0071 7.9293 2.7671 1.1124 2.9305 7.7315 6.7278 8.3894 1.0613 1.0988 1.0898 1.0926 1.0962 1.0641
irintensity: 0.9574 0.0314 0.3147 1.0544 0.0516 0.3759 0.5143 0.2532 1.0925 2.0745 4.6709 9.8711 41.8936 18.2695 12.3830 18.4241 142.7263 10.2111 8.1549 14.3816 28.7192 11.4712 28.7553 22.6691 12.3126 0.8078 34.7276 349.2304 30.3342 5.9380 0.0812 9.3458 4.3392 13.7726 61.3370 0.7787 20.2564 34.4429 69.9447 14.8441 3.6841 190.1954 11.5719 2.1125 7.4224 1.8464 2.8341 27.7404
temp: 298.150 k
press: 1.00000 atm
elementType: 17 17 8 8 6 6 6 6 6 6 6 6 1 1 1 1 1 1
symmnumber: 1
zpe: 316079.4 jmol-1
zpe.correction: 0.120388 hartree
zpe.thermalcorrener: 0.130933 hartree
zpe.thermalcorrenthalpy: 0.131877 hartree
zpe.thermalcorrgfe: 0.081993 hartree
zpe.sumelectzpe: -1378.157059 hartree
zpe.sumelectthermal: -1378.146514 hartree
zpe.sumelectthermalent: -1378.145570 hartree
zpe.sumelectthermalfe: -1378.195455 hartree
dipole: 3.4885 -1.0902 -1.8045
dipole: 4.0761
quadrupole: -77.5770 -76.5039 -87.5000
quadrupole: 1.8913 -0.6095 0.1942
quadrupole: 2.9500 4.0231 -6.9731 1.8913 -0.6095 0.1942
hfenergy: -1378.2774474 hartree
pointgroup: C01 [X(C8H6Cl2O2)]
dipole: 1.340859 -0.509794 -0.7168875 debye
dipolederiv: -0.2828345 0.2863566 0.025791 0.3328339 -0.5253854 -0.0282236 0.0299573 -0.0236899 -0.0406128 -0.7170765 -0.106191 0.1506586 -0.1093579 -0.0833052 0.0267426 0.1651698 0.0283714 -0.0694097 -1.4541744 -0.0446038 0.2923549 -0.0758335 -0.4226941 0.036806 0.1130938 0.0221523 -0.3108538 -0.7360232 -0.0313891 -0.001722 -0.0230659 -0.2764792 -0.0534835 0.1656426 -0.0332273 -0.897535 0.3070212 0.0373564 -0.0075779 0.0065289 0.0393602 -0.0045691 -0.0077017 -0.0082488 -0.0653962 -0.0382202 -0.0231553 -0.0923769 -0.0174109 0.112688 -0.0250841 -0.3123047 -0.0421526 -0.1969554 -0.1974587 0.148866 -0.0089566 0.0910856 -0.1267544 -0.0084769 0.0327434 -0.0081188 -0.087864 -0.0832325 -0.0574906 -0.0315008 -0.0411786 0.0376465 -0.0135075 0.0041096 -0.0226385 -0.1356831 0.188716 -0.5634793 -0.0041924 -0.493717 0.7595588 0.0302883 -0.017284 0.0664362 -0.0257582 -0.2174152 -0.0463074 0.0259958 0.0393178 0.0219303 -0.0139757 0.0184152 -0.0008487 -0.0831612 0.9621877 0.3089277 -0.2504985 0.1887256 -0.0922424 -0.0344835 -0.2532139 -0.0682209 0.0019925 1.7753513 0.0960627 -0.1378717 0.1236274 0.1956528 0.073115 -0.0015525 0.0722789 1.2079673 0.0339644 -0.0136538 -0.0116982 -0.0593542 0.0010056 0.0916574 0.0269198 0.0481127 0.0718395 0.0106951 0.0255233 0.010684 0.0613438 0.0021525 -0.0865943 0.0302029 -0.0358709 0.0855158 0.0665633 -0.0567165 0.0342266 -0.0568163 -0.0010337 0.0197408 0.0326986 0.0207259 0.14006 0.0071388 0.0973424 0.0341583 0.0903212 -0.0104699 -0.0012117 0.033034 -0.0052353 0.1414196 0.0634207 -0.0448104 0.0230945 -0.0435064 -0.0132958 0.0218158 0.0298537 0.0226732 0.1552856 0.3113768 -0.0126378 -0.0505687 -0.0135433 0.3816653 -0.0305561 -0.0897839 -0.0324989 0.1091492 unknown
polarizability: 153.6672061|-5.8977804|106.0681333|-15.912364|-1.7014511|63.3227352 unknown
InChI: InChI=1S/C8H6Cl2O2/c9-6-2-1-5(3-7(6)10)4-8(11)12/h1-3,11H,4H2
charge 0 multiplicity 1
18 atoms
Cl -2.696708 2.283943 -0.00689
Cl -3.968587 -0.708369 0.523891
O  4.230962 0.207762 -0.077872
O  2.546183 0.20963 1.522857
C  0.524278 -0.202623 -0.564242
C  1.993886 -0.042531 -0.901416
C  -0.31075 0.93408 -0.456307
C  -0.03324 -1.483924 -0.332569
C  -1.673056 0.791488 -0.126204
C  -1.396084 -1.629444 -0.000644
C  -2.219356 -0.489178 0.101631
C  2.888056 0.131533 0.326061
H  2.16926 0.834628 -1.552428
H  2.379265 -0.913635 -1.462844
H  0.090753 1.939066 -0.622992
H  0.596706 -2.377338 -0.406526
H  -1.828475 -2.618105 0.179033
H  4.810106 0.332116 0.72306
