program: Gaussian 09
title: 000080254
version: EM64L-G09RevD.01
frameworkgroup: C1[X(C13H17N3O4S)]
method: RPBEPBE
basis: SDD
operation: Freq
keyword: #p
keyword: freq=noraman
keyword: PBEPBE/SDD
title: #p freq=noraman PBEPBE/SDD
converged: YES YES NO NO
title: Mulliken charges:
elementType: S O O O O N N N C C C C C C C C C C C C C H H H H H H H H H H H H H H H H H
charge: 0.928116 -0.368476 -0.470003 -0.577155 -0.586963 -0.116285 -0.237366 -0.289606 0.034469 0.342390 0.119518 -0.508733 0.461738 -0.783646 -0.671213 -0.341368 -0.343774 -0.392251 -0.214245 -0.205721 -0.246010 0.236822 0.238793 0.236050 0.251104 0.271267 0.239806 0.298804 0.263240 0.308252 0.263152 0.238069 0.275637 0.260490 0.231286 0.229872 0.231824 0.392114
chargesum: 0.00000
title: Mulliken charges with hydrogens summed into heavy atoms:
elementType: S O O O O N N N C C C C C C C C C C C C C
charge: 0.928116 -0.368476 -0.077889 -0.577155 -0.586963 -0.116285 -0.237366 0.018646 0.034469 0.342390 0.119518 -0.033118 0.461738 -0.025225 0.130638 0.159854 -0.068137 -0.131761 0.017041 0.024151 -0.014186
polarizability: 2.63339146e+02 7.88896495e+00 1.97224808e+02 -1.83747081e+01 4.68226364e+00 1.51767928e+02
1716.lowfreq: -17.4297 -8.7320 -3.0296 -0.0024 -0.0018 0.0011 4.4422 22.9259 36.2506
frequency: -14.6244 22.7467 36.0140 55.6901 57.8068 77.6606 94.3293 108.2156 117.7817 136.5009 143.5453 156.8802 166.2061 176.4228 201.6774 228.1276 242.3564 254.8170 270.2142 284.4463 298.4211 325.7911 342.0245 369.1796 385.5098 389.8489 407.0539 435.1716 497.1810 509.3316 562.4468 584.8790 609.9476 620.0133 627.0626 634.0175 671.2562 696.0453 705.1820 762.4225 767.2033 827.8769 839.3957 845.3366 883.4494 891.0500 919.4034 923.5531 943.1892 973.0475 988.1070 993.3106 998.0236 1016.4043 1038.2829 1039.3475 1044.9711 1080.2498 1102.0271 1106.0684 1139.1740 1148.0287 1173.2163 1177.0717 1185.6483 1216.7251 1234.3402 1290.2436 1300.8179 1318.6773 1331.2574 1349.4425 1357.5131 1384.9349 1390.4979 1396.3246 1414.3627 1437.7382 1440.3129 1445.4660 1455.3669 1456.5816 1472.4005 1475.3500 1487.2643 1500.0256 1501.5309 1546.5469 1590.6590 1594.8669 1611.5449 2702.9876 2976.4907 2986.4176 2995.2271 2996.7604 3037.8148 3068.0008 3074.0681 3102.6033 3108.8764 3128.2506 3130.2806 3140.0463 3152.0220 3167.0674 3197.2523 3513.0864
redmass: 4.9530 6.3116 4.6853 5.2412 4.3515 4.8688 10.9212 1.2622 2.7611 5.5331 4.1358 1.1724 3.4649 4.4211 8.1124 3.6536 5.3648 4.2286 6.7521 3.7782 4.4645 4.2239 3.8042 2.4326 16.4657 5.4589 2.8893 5.3834 3.4676 3.5625 2.6674 5.2362 4.5090 2.9128 4.9215 2.8914 5.1520 2.0460 6.5608 1.7978 5.8453 14.1951 3.1487 1.5291 3.3504 15.8331 1.4680 1.6752 2.3512 1.3746 5.3644 1.3400 1.2279 2.9498 1.7805 1.8665 1.7095 1.6669 1.8150 1.6951 2.7503 2.5317 1.0539 2.5891 1.1432 3.0759 1.2213 1.2149 4.5803 1.5175 1.3318 1.2815 3.6209 6.4834 1.1520 1.3730 1.6153 1.2566 1.5574 1.9049 1.1113 1.1009 1.0606 1.1415 2.5506 1.2212 1.1257 7.5648 7.0644 6.7799 6.1647 1.0826 1.0626 1.0394 1.0603 1.0363 1.0994 1.0969 1.1073 1.0991 1.0973 1.1008 1.0856 1.0891 1.0947 1.0999 1.0958 1.0752
irintensity: 2.3455 1.4448 5.6799 2.3629 3.6160 1.4237 0.7777 0.9924 0.5504 2.9696 2.9994 0.7284 13.5811 3.4660 20.3809 7.9708 8.7484 13.2230 15.7446 4.5647 27.7686 0.9108 32.7408 10.5934 17.6785 20.2562 0.5234 12.3560 15.2952 10.0758 15.2551 20.0644 28.8425 95.2265 82.7739 82.6387 8.8617 34.8969 16.8316 100.3022 108.1259 18.7847 9.1145 1.0299 10.2897 77.6396 3.7974 3.9249 7.2386 1.9565 2.8064 1.2801 189.5135 23.5548 2.3523 2.8287 1.6811 20.2866 12.0403 6.3283 3.0744 35.1530 0.0169 25.6161 0.6345 11.7037 6.5937 53.9509 7.3336 25.4248 24.2990 2.4271 91.3121 3.7509 31.7764 14.0544 29.4844 22.1907 19.0192 54.1620 31.0629 16.7778 7.6447 9.2442 124.2215 17.7979 12.7978 254.0380 57.3199 3.1604 45.2526 1087.5344 45.1029 13.4554 18.5560 36.0170 9.3097 10.6764 20.2549 4.4153 13.2713 11.5275 1.2499 6.4872 24.1931 26.0464 0.7848 15.0464
temp: 298.150 k
press: 1.00000 atm
elementType: 16 8 8 8 8 7 7 7 6 6 6 6 6 6 6 6 6 6 6 6 6 1 1 1 1 1 1 1 1 1 1 1 1 1 1 1 1 1
symmnumber: 1
zpe: 764328.2 jmol-1
zpe.correction: 0.291117 hartree
zpe.thermalcorrener: 0.312182 hartree
zpe.thermalcorrenthalpy: 0.313126 hartree
zpe.thermalcorrgfe: 0.240507 hartree
zpe.sumelectzpe: -1367.108719 hartree
zpe.sumelectthermal: -1367.087655 hartree
zpe.sumelectthermalent: -1367.086711 hartree
zpe.sumelectthermalfe: -1367.159329 hartree
dipole: -2.6869 3.6508 -0.4545
dipole: 4.5557
quadrupole: -124.3537 -116.9887 -132.7083
quadrupole: -1.7149 -7.0144 -2.9798
quadrupole: 0.3299 7.6948 -8.0247 -1.7149 -7.0144 -2.9798
hfenergy: -1367.3998362 hartree
pointgroup: C01 [X(C13H17N3O4S1)]
dipole: 1.2539102 -1.2788155 -0.0697752 debye
polarizability: 261.7791343|18.9287631|198.0788624|2.1522197|-13.8657187|152.4738855 unknown
InChI: InChI=1S/C13H17N3O2.O2S/c1-10-12(8-14-9-17)13(18)16(15(10)2)11-6-4-3-5-7-11;1-3-2/h3-7,14,17H,8-9H2,1-2H3;
charge 0 multiplicity 1
38 atoms
S  -2.125617 0.829245 2.314515
O  -0.522462 0.954691 -1.389398
O  -2.62793 1.550757 0.063567
O  -3.155791 -0.440209 2.277928
O  -0.56762 0.339117 2.281064
N  0.941707 -1.75862 0.381994
N  0.994246 -0.472688 -0.221928
N  -3.237128 -0.303667 -1.501008
C  -1.098203 -1.334242 -0.57065
C  -0.364177 -2.233706 0.199473
C  -0.257298 -0.174703 -0.807757
C  -2.525043 -1.523393 -1.074553
C  2.218209 0.249582 -0.361445
C  -0.814526 -3.509015 0.850558
C  1.674562 -1.937235 1.658525
C  -3.694724 0.637295 -0.527822
C  2.213613 1.656012 -0.197788
C  3.418111 -0.434581 -0.683307
C  3.417806 2.373037 -0.359775
C  4.619242 0.292936 -0.820224
C  4.624021 1.698568 -0.661829
H  -3.129552 -2.00105 -0.281251
H  -2.523462 -2.218835 -1.937134
H  -0.067499 -4.315671 0.745722
H  -1.754937 -3.855957 0.394998
H  -1.010065 -3.352621 1.928417
H  1.590297 -2.993692 1.955691
H  1.23496 -1.285047 2.434639
H  2.739168 -1.696441 1.521501
H  -2.872647 0.111307 -2.363757
H  -4.126108 0.112885 0.345679
H  -4.431982 1.32898 -0.970404
H  1.279018 2.165597 0.044171
H  3.397895 -1.51721 -0.850281
H  3.414204 3.461579 -0.238268
H  5.546344 -0.235999 -1.066921
H  5.556235 2.261936 -0.776905
H  -1.781267 1.484859 -0.53714
