program: Gaussian 09
title: 000079879
version: EM64L-G09RevD.01
frameworkgroup: C1[X(C12H21NO2)]
method: RPBEPBE
basis: SDD
operation: Freq
keyword: #p
keyword: freq=noraman
keyword: PBEPBE/SDD
title: #p freq=noraman PBEPBE/SDD
converged: YES YES NO NO
title: Mulliken charges:
elementType: O O N C C C C C C C C C C C C H H H H H H H H H H H H H H H H H H H H H
charge: -0.417820 -0.236876 -0.024223 -0.385905 -0.384377 -0.373374 -0.374721 -0.387668 -0.377788 -0.372721 -0.380126 -0.501916 -0.445296 0.191522 -0.141941 0.190709 0.198282 0.200089 0.192014 0.199991 0.186713 0.197895 0.189413 0.184876 0.229483 0.228360 0.189459 0.220971 0.202771 0.217995 0.213479 0.254791 0.246547 0.251048 0.244368 0.373975
chargesum: 0.00000
title: Mulliken charges with hydrogens summed into heavy atoms:
elementType: O O N C C C C C C C C C C C C
charge: -0.043844 -0.236876 -0.024223 0.003086 0.007726 0.013331 0.012587 0.026691 0.040032 0.051021 0.051348 -0.000578 0.050120 0.191522 -0.141941
polarizability: 1.70088573e+02 -6.49194903e+00 1.27411519e+02 -5.97792922e+00 4.04892786e+00 1.17241972e+02
1716.lowfreq: -9.9766 -0.0008 -0.0003 0.0008 1.3588 11.4771 16.8314 23.2481 28.7770
frequency: 12.2856 23.0753 28.7268 38.1337 57.2346 67.9589 74.3117 112.2736 116.7280 131.0471 148.9799 152.3189 191.6853 209.3813 232.3971 250.1342 334.5485 345.9760 368.9744 437.8753 456.2630 499.7974 508.2135 569.6312 587.6504 641.8723 722.0561 726.0843 736.8876 760.9547 797.4806 834.2405 841.0872 859.0486 886.3616 943.4232 984.4081 987.5610 1008.8603 1023.4138 1033.1259 1044.6125 1066.1545 1078.7559 1080.7476 1084.5824 1094.8079 1117.9412 1136.4595 1184.6468 1203.3715 1205.3212 1234.6060 1240.6192 1254.0387 1266.3706 1274.1243 1283.8956 1294.0890 1295.6507 1296.9956 1303.9461 1317.1003 1326.8554 1349.1394 1358.3685 1361.8238 1363.2969 1367.2264 1434.7462 1445.2627 1457.7635 1460.8262 1462.0861 1465.2460 1466.3462 1474.4921 1482.5735 1488.0507 1669.5232 2195.5934 2951.1228 2952.2778 2954.0355 2958.8095 2962.6342 2966.2982 2982.8172 2984.3815 2986.9463 2992.5773 2993.5572 2994.4356 3005.4770 3017.2864 3026.9571 3037.5277 3045.0388 3046.4569 3057.5023 3058.2336 3511.8659
redmass: 6.0081 7.3015 4.7284 5.4074 2.9903 4.5944 2.0399 1.9684 3.0695 2.6368 2.2844 2.1466 2.7959 2.7346 3.4137 3.3904 3.4356 3.7019 3.1511 3.9185 2.8842 2.0972 3.1822 3.3953 3.3225 1.3671 1.0632 1.1272 1.2450 1.4685 1.8168 1.9514 2.3340 1.9543 1.6072 1.4151 4.3433 2.8668 1.3845 3.6087 3.1544 2.1055 2.6938 2.1982 2.0867 2.0064 3.2959 1.5250 1.7706 1.2330 1.3408 1.4320 1.2923 1.4097 1.5635 1.2599 1.2822 1.0288 1.1760 1.1694 1.1292 1.1340 1.2815 1.3383 1.4279 1.6924 1.7014 1.5846 1.6264 1.0900 1.0865 1.0784 1.0792 1.0668 1.0604 1.0902 1.0978 1.1004 1.1008 8.0504 12.4221 1.0589 1.0590 1.0598 1.0611 1.0619 1.0605 1.0625 1.0635 1.0911 1.0605 1.0886 1.0699 1.0986 1.1001 1.1019 1.1036 1.1004 1.1005 1.1028 1.1024 1.0639
irintensity: 1.0327 0.2410 1.9326 2.9353 1.3701 0.9756 1.2833 0.2751 1.9237 0.4124 0.1363 0.0448 0.6686 1.8070 1.0592 1.5859 1.7101 0.3065 0.4384 7.8753 1.7047 31.6680 23.5139 1.8363 3.8031 135.0238 17.4117 1.2879 6.3475 0.4371 0.7110 0.3575 1.7340 10.2467 0.6713 0.4414 10.7187 3.9212 6.5818 65.7652 76.7597 143.6231 10.2786 0.8803 0.0569 2.2060 0.5487 3.1523 27.8136 12.8685 2.5514 0.9896 4.7015 0.7754 5.4360 0.1940 5.3323 0.2170 1.8888 0.2125 0.1616 2.8235 2.8931 0.4238 0.1431 1.0884 21.2937 8.9539 16.4188 35.8976 18.1595 4.6385 0.7997 1.6150 0.3291 0.0146 4.2154 0.0977 29.5465 191.3938 10.6900 1.6438 1.0848 1.9828 1.0973 13.0861 142.4610 38.8455 32.5104 24.1946 18.4491 6.6527 17.4782 5.0252 0.7372 1.2202 39.6905 18.5109 57.7731 8.8620 165.7804 19.7511
temp: 298.150 k
press: 1.00000 atm
elementType: 8 8 7 6 6 6 6 6 6 6 6 6 6 6 6 1 1 1 1 1 1 1 1 1 1 1 1 1 1 1 1 1 1 1 1 1
symmnumber: 1
zpe: 814757.2 jmol-1
zpe.correction: 0.310325 hartree
zpe.thermalcorrener: 0.328612 hartree
zpe.thermalcorrenthalpy: 0.329557 hartree
zpe.thermalcorrgfe: 0.259210 hartree
zpe.sumelectzpe: -673.872437 hartree
zpe.sumelectthermal: -673.854149 hartree
zpe.sumelectthermalent: -673.853205 hartree
zpe.sumelectthermalfe: -673.923551 hartree
dipole: 1.8240 -4.6983 -1.6752
dipole: 5.3110
quadrupole: -99.1736 -101.1197 -90.6543
quadrupole: 21.3915 11.7715 -5.3656
quadrupole: -2.1911 -4.1371 6.3282 21.3915 11.7715 -5.3656
hfenergy: -674.1827615 hartree
pointgroup: C01 [X(C12H21N1O2)]
dipole: 0.7391426 -1.8262516 -0.6960988 debye
polarizability: 170.2046408|-5.8028099|127.0971574|-6.336197|4.1763817|117.4402648 unknown
InChI: InChI=1S/C12H21NO2/c13-11-9-7-5-3-1-2-4-6-8-10-12(14)15/h14H,1-10H2
charge 0 multiplicity 1
36 atoms
O  6.897101 0.382796 -1.05512
O  5.150816 1.732725 -0.340681
N  -6.719322 1.778503 0.896405
C  0.251729 -0.610361 -0.266689
C  -1.146719 -0.513835 0.383409
C  1.405743 -0.509093 0.755975
C  -2.30334 -0.605293 -0.637348
C  2.804948 -0.597438 0.107449
C  -3.698596 -0.514142 0.020281
C  3.948104 -0.494949 1.142514
C  -4.848694 -0.594791 -1.006147
C  5.355428 -0.590752 0.51964
C  -6.263148 -0.530251 -0.361259
C  5.733381 0.627245 -0.303913
C  -6.520832 0.742414 0.337925
H  0.334509 -1.569469 -0.820076
H  0.361717 0.195563 -1.021855
H  -1.226147 0.442955 0.940097
H  -1.257366 -1.321865 1.136755
H  1.320984 0.450088 1.307726
H  1.29714 -1.315133 1.512252
H  -2.196314 0.208236 -1.384857
H  -2.220986 -1.558987 -1.200163
H  2.893339 -1.556176 -0.446267
H  2.913498 0.215664 -0.636795
H  -3.776848 0.435724 0.586484
H  -3.808922 -1.331948 0.762974
H  3.857971 0.462912 1.690059
H  3.839965 -1.306078 1.889786
H  -4.749393 0.22288 -1.745811
H  -4.782094 -1.54673 -1.569093
H  6.1290 -0.695052 1.307013
H  5.456662 -1.486499 -0.121719
H  -7.043258 -0.663835 -1.135151
H  -6.383207 -1.357197 0.365519
H  7.135749 1.206468 -1.561717
