program: Gaussian 09
title: 000079863
version: EM64L-G09RevD.01
frameworkgroup: C1[X(CH2Cl2O4S2)]
method: RPBEPBE
basis: SDD
operation: Freq
keyword: #p
keyword: freq=noraman
keyword: PBEPBE/SDD
title: #p freq=noraman PBEPBE/SDD
converged: YES YES NO NO
title: Mulliken charges:
elementType: Cl Cl S S O O O O C H H
charge: -0.142533 -0.142373 0.956920 0.956801 -0.411858 -0.411886 -0.411962 -0.411815 -0.697252 0.358051 0.357908
chargesum: 0.00000
title: Mulliken charges with hydrogens summed into heavy atoms:
elementType: Cl Cl S S O O O O C
charge: -0.142533 -0.142373 0.956920 0.956801 -0.411858 -0.411886 -0.411962 -0.411815 0.018707
polarizability: 1.56528685e+02 5.78454116e-03 1.13534091e+02 1.42855709e-02 2.96043372e-02 8.03643777e+01
1716.lowfreq: -5.9617 0.0006 0.0007 0.0023 7.0011 9.0196 14.2988 51.4806 60.6790
frequency: 14.2074 51.3836 60.6789 116.2665 121.7300 140.0137 166.6669 200.5196 219.4637 235.6525 261.0048 319.7360 350.1515 380.6145 453.6373 517.7221 527.9114 805.5631 827.1879 841.9602 947.0117 995.9842 1104.1182 1182.9099 1294.3319 3079.5616 3215.5637
redmass: 19.2041 7.0382 24.0947 18.1701 19.1641 16.9344 14.0182 16.0867 19.9164 24.0687 2.5236 13.0920 11.9144 22.1064 27.2028 8.1109 8.0683 1.6563 17.2164 18.3388 5.3402 10.1003 1.1926 1.1327 1.0671 1.0500 1.1200
irintensity: 0.0000 6.0929 2.5587 4.0541 0.4092 0.0000 5.0118 0.0001 1.7193 0.3950 1.0017 94.4194 49.5184 41.7903 27.9562 10.1720 49.4979 0.0773 23.4519 86.1946 0.0002 93.2951 0.0000 15.7793 4.9272 12.4405 24.2385
temp: 298.150 k
press: 1.00000 atm
elementType: 17 17 16 16 8 8 8 8 6 1 1
symmnumber: 1
zpe: 110245.2 jmol-1
zpe.correction: 0.041990 hartree
zpe.thermalcorrener: 0.054236 hartree
zpe.thermalcorrenthalpy: 0.055180 hartree
zpe.thermalcorrgfe: 0.000233 hartree
zpe.sumelectzpe: -2055.374925 hartree
zpe.sumelectthermal: -2055.362679 hartree
zpe.sumelectthermalent: -2055.361735 hartree
zpe.sumelectthermalfe: -2055.416682 hartree
dipole: -0.0009 2.7010 -0.0165
dipole: 2.7011
quadrupole: -93.2415 -86.0811 -89.1114
quadrupole: -0.0035 0.0058 -0.0140
quadrupole: -3.7635 3.3969 0.3666 -0.0035 0.0058 -0.0140
hfenergy: -2055.4169149 hartree
pointgroup: C01 [X(C1H2Cl2O4S2)]
dipole: -0.0003309 0.0319685 1.0621969 debye
dipolederiv: -0.5943812 -0.0005327 -0.1728839 -0.0037306 -0.1828463 -0.0060672 -0.3419346 -0.0046733 -0.5063695 -0.5946487 0.0078034 0.17294 0.0115779 -0.1830356 -0.0096707 0.3419517 -0.0111763 -0.5063309 1.4799005 0.0004642 0.1887411 -0.015598 0.9810245 0.006839 -0.3711495 0.0114347 1.3460138 1.4804362 -0.0087481 -0.188624 0.0071848 0.981165 0.0107429 0.3713438 0.0060819 1.3462819 -0.4016007 -0.0177986 -0.0083492 0.0557284 -0.4071437 -0.0938189 0.1671559 -0.0130814 -0.4225974 -0.4026683 0.017401 -0.0074031 -0.0473222 -0.4020925 0.0932002 0.170538 0.0093817 -0.4278579 -0.4021147 -0.0175018 0.009146 0.0471083 -0.4023718 0.0929524 -0.1704537 0.0122319 -0.4282054 -0.4023262 0.0175862 0.0065316 -0.0560038 -0.4069017 -0.0940699 -0.1672698 -0.0101859 -0.422347 0.0171619 -0.0020354 0.0000179 -0.0020607 -0.2101701 0.0013174 -0.0000965 0.0015848 -0.1568732 -0.0898966 0.0016729 -0.0003949 0.0015388 0.1149239 -0.0349845 -0.0001922 -0.0104865 0.0903445 -0.0898623 0.001689 0.0002786 0.0015772 0.1174483 0.0335592 0.0001068 0.0088883 0.087941 unknown
polarizability: 156.5232109|-0.6454849|80.387466|0.0216484|0.7646828|113.5164769 unknown
InChI: InChI=1S/CH2O4S2.2Cl/c2-6(3)1-7(4)5;;/h1H2;;
charge 0 multiplicity 1
11 atoms
Cl 2.964396 0.01692 1.812287
Cl -2.964373 0.069123 1.810696
S  1.627557 -0.018885 -0.21503
S  -1.627614 0.006489 -0.215403
O  1.771139 -1.451851 -0.937375
O  1.801678 1.372799 -1.007917
O  -1.777192 1.399338 -1.01143
O  -1.795762 -1.425277 -0.934591
C  0.000034 0.024009 0.843175
H  -0.007092 -0.894142 1.446958
H  0.007429 0.974177 1.395229
