program: Gaussian 09
title: 000079858
version: EM64L-G09RevD.01
frameworkgroup: C1[X(C7H6BrNO2)]
method: RPBEPBE
basis: SDD
operation: Freq
keyword: #p
keyword: freq=noraman
keyword: PBEPBE/SDD
title: #p freq=noraman PBEPBE/SDD
converged: YES YES NO YES
title: Mulliken charges:
elementType: Br O O N C C C C C C C H H H H H H
charge: 0.001282 -0.438098 -0.314969 -0.677374 0.109590 0.338237 -0.236602 -0.382162 -0.239279 -0.152324 0.150411 0.290174 0.229377 0.249535 0.307553 0.377237 0.387413
chargesum: 0.00000
title: Mulliken charges with hydrogens summed into heavy atoms:
elementType: Br O O N C C C C C C C
charge: 0.001282 -0.050684 -0.314969 0.007415 0.109590 0.338237 0.053571 -0.152785 -0.239279 0.097211 0.150411
polarizability: 1.66053130e+02 4.22161045e+00 1.20131337e+02 -3.30899565e-03 6.08307160e-03 3.95293552e+01
1716.lowfreq: -0.0003 0.0003 0.0005 2.3206 2.8913 10.0997 78.0295 125.2893 138.2830
frequency: 78.0037 125.2848 138.2754 142.8632 265.4185 281.7587 302.8182 362.9851 411.5159 419.5517 478.0543 500.6113 522.1936 572.5973 610.7788 619.3307 680.7083 729.4015 744.6643 774.0798 816.9500 843.8784 921.7545 956.9447 1008.1974 1045.3822 1080.2021 1144.4348 1169.1238 1277.4945 1318.5777 1338.9099 1387.3897 1416.2636 1483.2239 1543.8283 1575.7253 1626.9003 1639.6149 3135.3706 3168.1405 3185.9749 3408.8446 3539.2429 3648.3309
redmass: 9.1169 6.7096 10.4239 4.8898 11.0321 5.9723 5.4598 5.9467 5.9950 2.8700 1.1804 4.0448 2.7991 1.2522 6.7900 5.3869 4.9681 1.3827 5.4998 2.3961 1.5935 6.5229 1.4159 1.3445 4.7641 1.7686 2.0101 1.7288 1.1877 1.4033 2.6076 2.6475 5.9399 5.7440 3.0418 3.1820 6.6023 2.2048 3.0076 1.0888 1.0962 1.0927 1.0559 1.0642 1.0949
irintensity: 0.1560 1.5293 0.0101 3.0038 2.3464 1.3888 2.0586 12.7031 2.2319 35.8964 84.8157 7.7230 18.4560 180.9860 34.6702 33.1556 13.7092 81.0696 13.0576 83.7236 45.9579 18.7163 9.0468 1.4620 250.1488 27.1849 42.6135 144.6549 43.6991 7.7395 15.8232 122.1992 0.5838 3.4828 99.1922 264.8193 161.2140 194.0592 131.5619 10.1680 7.4134 2.4843 124.8266 60.7220 56.2441
temp: 298.150 k
press: 1.00000 atm
elementType: 35 8 8 7 6 6 6 6 6 6 6 1 1 1 1 1 1
symmnumber: 1
zpe: 313670.4 jmol-1
zpe.correction: 0.119471 hartree
zpe.thermalcorrener: 0.129338 hartree
zpe.thermalcorrenthalpy: 0.130283 hartree
zpe.thermalcorrgfe: 0.083105 hartree
zpe.sumelectzpe: -488.240078 hartree
zpe.sumelectthermal: -488.230210 hartree
zpe.sumelectthermalent: -488.229266 hartree
zpe.sumelectthermalfe: -488.276444 hartree
dipole: 1.8801 2.0098 0.0063
dipole: 2.7521
quadrupole: -74.1063 -56.2138 -76.6863
quadrupole: 1.4955 0.0184 0.0076
quadrupole: -5.1042 12.7884 -7.6841 1.4955 0.0184 0.0076
hfenergy: -488.3595487 hartree
pointgroup: C01 [X(C7H6Br1N1O2)]
dipole: -0.5141919 0.9527291 -0.0169351 debye
dipolederiv: -0.541449 0.2575148 -0.012011 0.3257092 -0.2338913 0.0078933 -0.0118246 0.0061584 -0.0401688 -0.2977804 -0.1241498 0.003414 -0.3921642 -1.3971707 -0.0061619 0.0040495 -0.0001819 -0.4223371 -1.2813054 0.029158 -0.0211881 0.0830399 -0.6032154 0.0026079 -0.0215729 0.0014485 -0.3581056 -0.9605456 0.7306327 -0.0085759 0.5042822 -0.7149775 0.0111699 -0.0079377 0.0159367 -0.6578048 -0.8716409 -0.5426489 -0.0167081 -0.0243561 -0.4168384 0.0004251 -0.0183468 -0.0113867 -0.068679 0.9221323 -0.8858596 0.0198699 -0.4169718 0.594691 -0.0107244 0.0190721 -0.0217487 0.1571609 0.2501304 0.4407252 0.0050485 0.0215795 -0.0989134 0.0006458 0.0062804 0.009906 -0.0266857 -0.321991 0.4689479 -0.0037885 -0.0083349 0.0605124 -0.0012209 -0.0023516 0.0096142 -0.2196753 0.6561804 -0.78602 0.0210397 -0.8196539 -0.05136 -0.0188112 0.0204915 -0.0175031 -0.1860032 -0.1321335 0.0160319 -0.0020439 0.1865114 0.3679658 0.0029078 -0.0021648 -0.0010757 -0.0432977 1.7808894 0.4710174 0.0340368 0.5425938 1.6265515 0.0084681 0.0341725 0.0070589 0.2369079 0.1461733 -0.0055495 -0.0002783 0.0167892 0.0340403 0.0007925 -0.0001821 0.0003164 0.1588969 0.0448551 0.047592 -0.0029541 0.0008044 -0.1195624 0.0010343 -0.0028076 0.0021537 0.1710908 -0.0235742 -0.0726942 -0.0037269 -0.0607863 0.0852772 -0.0011159 -0.003822 -0.0015374 0.1519103 0.1927578 -0.0768655 -0.0039862 -0.0707412 0.1868069 -0.0008206 -0.0042587 -0.000526 0.372983 0.3122397 0.0254346 -0.001658 0.0147725 0.2907332 0.0006713 -0.0020188 0.0012476 0.3736311 0.1250613 0.006733 -0.0064898 0.0969264 0.3893508 0.002239 -0.0067785 0.0001192 0.4001762 unknown
polarizability: 160.9472786|-14.9543717|125.1721935|2.7926346|-0.5970908|39.5943504 unknown
InChI: InChI=1S/C7H6BrNO2/c8-4-1-2-6(9)5(3-4)7(10)11/h1-3,10H,9H2
charge 0 multiplicity 1
17 atoms
Br 3.554175 -1.445745 0.037941
O  -1.778813 -2.221979 -0.080805
O  -2.956104 -0.229029 -0.11343
N  -1.547423 2.06043 -0.088015
C  -0.515982 -0.175885 -0.057181
C  -0.42309 1.265344 -0.059264
C  0.669697 -0.96733 -0.027886
C  0.882326 1.853859 -0.03238
C  1.922757 -0.351718 -0.001413
C  2.037799 1.062899 -0.003868
C  -1.832416 -0.822217 -0.085766
H  0.569074 -2.055053 -0.026663
H  0.976023 2.945836 -0.034261
H  3.024498 1.535433 0.016787
H  -1.462598 3.073599 -0.090347
H  -2.465449 1.600527 -0.108811
H  -2.709573 -2.57077 -0.10184
