program: Gaussian 09
title: 000079848
version: EM64L-G09RevD.01
frameworkgroup: C1[X(C8H10N2O2)]
method: RPBEPBE
basis: SDD
operation: Freq
keyword: #p
keyword: freq=noraman
keyword: PBEPBE/SDD
title: #p freq=noraman PBEPBE/SDD
converged: YES YES NO NO
title: Mulliken charges:
elementType: O O N N C C C C C C C C H H H H H H H H H H
charge: -0.264499 -0.274305 -0.399234 -0.502625 0.325925 -0.491183 0.352216 -0.389259 -0.358788 -0.221547 0.135970 -0.536710 0.294216 0.228624 0.245283 0.226585 0.327365 0.220810 0.222152 0.248780 0.307289 0.302935
chargesum: 0.00000
title: Mulliken charges with hydrogens summed into heavy atoms:
elementType: O O N N C C C C C C C C
charge: -0.264499 -0.274305 -0.071869 0.107598 0.325925 -0.196967 0.352216 -0.160635 -0.113505 0.005038 0.135970 0.155034
polarizability: 1.62297250e+02 -1.61455298e+00 1.11038875e+02 1.44022970e+00 8.10193332e-02 5.45526390e+01
1716.lowfreq: -10.1088 -9.1140 -0.0009 -0.0005 0.0003 4.7886 42.5472 81.1688 110.6446
frequency: 42.5419 81.1588 110.6414 125.9808 134.8312 200.9570 216.2287 245.5902 263.0042 276.3682 324.7435 401.4398 437.7255 487.9088 540.4033 555.7696 570.3857 659.9883 688.8679 733.8869 775.7381 785.6612 799.1074 879.1910 895.3752 925.5647 966.5717 979.5544 1004.8000 1070.7299 1096.2263 1111.2921 1148.2532 1165.2746 1190.3790 1229.6218 1277.2424 1288.3391 1296.8677 1392.7787 1421.6776 1433.4904 1455.2428 1467.4429 1472.3163 1475.9027 1574.0518 1602.6024 1619.8289 1681.9676 2959.6500 3047.7955 3128.2883 3130.2532 3149.4585 3168.5823 3172.9117 3384.2932 3497.7381 3562.0660
redmass: 5.7583 3.4719 3.6668 3.9410 1.2497 1.6321 3.1871 3.8184 1.8583 4.5836 4.3861 6.0529 3.6831 4.3030 2.9667 2.0833 2.3163 6.9867 2.3237 2.9410 4.4036 1.8508 1.8381 1.4469 5.7971 1.5274 1.3395 5.6381 5.3844 2.2155 1.7055 1.2601 1.6848 1.6375 1.2719 3.5732 1.8834 1.1651 1.7129 7.0450 2.1376 1.2639 1.8899 1.0552 1.2957 1.8745 6.3337 7.7943 6.7896 1.0612 1.0331 1.1040 1.0986 1.0868 1.0930 1.0965 1.0927 1.0429 1.0981 1.0792
irintensity: 3.5245 2.8556 6.5105 4.5965 15.7365 0.2573 4.9202 5.9555 0.9455 18.7150 19.8765 2.7616 1.4329 15.3827 33.9392 92.3376 36.8596 0.0369 20.0463 34.9547 3.5455 154.1368 53.3506 0.9702 15.2042 24.2854 0.6962 3.3665 64.3337 2.1562 6.8855 0.2103 5.6872 23.6088 1.1793 65.2533 164.8885 0.7117 49.6089 13.4494 14.0652 69.1061 261.8731 12.8851 2.9387 4.1858 145.9049 77.0890 35.8071 31.0512 63.4746 48.8284 22.8967 5.0798 17.7970 10.9369 5.8710 0.3555 1.7950 27.6202
temp: 298.150 k
press: 1.00000 atm
elementType: 8 8 7 7 6 6 6 6 6 6 6 6 1 1 1 1 1 1 1 1 1 1
symmnumber: 1
zpe: 453280.3 jmol-1
zpe.correction: 0.172645 hartree
zpe.thermalcorrener: 0.184556 hartree
zpe.thermalcorrenthalpy: 0.185500 hartree
zpe.thermalcorrgfe: 0.134300 hartree
zpe.sumelectzpe: -569.878696 hartree
zpe.sumelectthermal: -569.866785 hartree
zpe.sumelectthermalent: -569.865841 hartree
zpe.sumelectthermalfe: -569.917041 hartree
dipole: 2.6224 3.3198 0.6366
dipole: 4.2782
quadrupole: -53.5089 -71.0504 -72.8540
quadrupole: 0.2715 0.8833 -2.4378
quadrupole: 12.2956 -5.2460 -7.0496 0.2715 0.8833 -2.4378
hfenergy: -570.0513409 hartree
pointgroup: C01 [X(C8H10N2O2)]
dipole: 1.0824544 1.2786879 0.1622777 debye
dipolederiv: -1.4437298 0.4698293 -0.0599675 0.7023063 -0.6054317 0.0404 -0.0935029 0.0432745 -0.3067837 -0.7238205 -0.2110625 -0.0074081 -0.047284 -0.9021029 -0.1733793 0.0823178 -0.1100171 -0.4081762 -0.5489049 0.2665775 0.0984977 0.5366523 -0.416471 0.0126963 0.1906874 0.0790207 -0.4227035 -0.2996018 0.1167654 0.0891335 0.2225776 -0.250098 -0.1380108 0.1316113 -0.1118698 -0.115152 -0.3255712 -0.1637521 0.0218744 -0.1543521 0.1164069 -0.0506318 -0.0204422 -0.0383098 0.003012 -0.3630429 0.292575 -0.0269428 -0.0860322 -0.0377726 -0.0135491 -0.0228213 0.0074292 -0.1414383 1.0204607 -0.6185501 0.0759217 -0.9423839 0.5343189 -0.0555919 0.1222526 -0.0547611 0.1140916 -0.1565067 -0.1028632 0.0332641 0.0682671 -0.1557231 -0.0174636 0.0840415 -0.0156104 -0.1925577 -0.101068 -0.0136313 0.0061519 0.3272282 -0.2306012 0.0077679 -0.0340967 0.0014328 -0.2069118 0.0884404 0.0707873 -0.0046423 -0.0281088 0.1558781 -0.0359833 0.0069581 -0.0346071 -0.1224738 1.4717885 -0.011357 -0.1686331 -0.1874686 1.0984193 0.3133486 -0.2512316 0.2195867 0.309598 0.873832 -0.1383089 0.0190302 0.1504597 0.1866834 0.0169403 -0.009124 0.0132202 0.3272189 0.148435 -0.0208702 0.0011202 0.0071436 0.032979 0.018578 0.0157604 0.008519 0.1664003 -0.0375892 0.1066251 -0.0212451 0.0963302 0.0292993 0.0227027 -0.0360035 0.0164927 0.1566517 -0.0885842 -0.0522837 0.0010135 -0.0557784 0.0935868 0.0087597 0.0030181 0.0068853 0.1679021 0.0612712 -0.038368 0.0015335 -0.0432902 -0.1120723 0.0324331 0.0007927 0.0345544 0.1494807 0.1602869 -0.0721433 -0.0009548 -0.1127612 0.1548845 -0.05972 -0.0154255 -0.0819477 0.3051174 -0.0370522 0.0191051 -0.0121227 -0.150507 0.0086632 -0.1356741 -0.0515511 -0.0993512 -0.0665173 -0.036747 0.0199141 0.0085161 -0.1377682 0.0543542 0.1067945 0.0826606 0.0731737 -0.1093324 -0.0174535 0.0889738 -0.0107551 0.1438008 -0.0492697 0.0199944 -0.0172589 0.0191976 0.1222491 0.1681309 0.0410759 -0.0654019 -0.1060919 0.0697479 0.1331811 -0.1238845 0.0455929 0.2376645 0.1870262 -0.0490384 0.0220164 -0.2029395 0.2243208 -0.0535928 -0.0447582 -0.0219056 0.0326602 unknown
polarizability: 162.1279513|-3.4468981|111.0933376|-1.0756649|-2.606092|54.6674756 unknown
InChI: InChI=1S/C8H10N2O2/c1-12-7-4-2-3-6(5-7)8(11)10-9/h2-5,10H,9H2,1H3
charge 0 multiplicity 1
22 atoms
O  2.776564 -1.187746 0.187336
O  -2.266594 -1.520404 -0.265137
N  -3.011426 0.574908 0.395708
N  -4.372975 0.174588 0.491421
C  -0.607671 0.258278 -0.017591
C  0.461031 -0.655845 0.08834
C  1.797632 -0.192566 0.066145
C  -0.340481 1.647921 -0.171218
C  2.072465 1.192071 -0.07233
C  0.994165 2.098441 -0.197042
C  -2.003288 -0.309547 0.013856
C  4.180399 -0.769886 0.153896
H  0.252968 -1.725827 0.179628
H  -1.154307 2.366432 -0.316941
H  3.09983 1.56715 -0.094258
H  1.205998 3.165598 -0.325868
H  -2.801493 1.495288 0.781961
H  4.418433 -0.087057 0.992829
H  4.432359 -0.280626 -0.807182
H  4.757481 -1.699962 0.258622
H  -4.444409 -0.68852 1.051627
H  -4.758782 0.01041 -0.449901
