program: Gaussian 09
title: 000079829
version: EM64L-G09RevD.01
frameworkgroup: C1[X(C7H9N3O)]
method: RPBEPBE
basis: SDD
operation: Freq
keyword: #pfreq=noraman
keyword: PBEPBE/SDD
title: #p freq=noraman PBEPBE/SDD
converged: YES YES NO NO
title: Mulliken charges:
elementType: O N N N C C C C C C C H H H H H H H H H
charge: -0.379111 -0.336092 0.005759 0.015141 0.289308 -0.370889 -0.333161 -0.199415 -0.198939 -0.253994 -0.565072 0.239906 0.259049 0.226785 0.224657 0.228425 0.247310 0.252992 0.250366 0.396976
chargesum: 0.00000
title: Mulliken charges with hydrogens summed into heavy atoms:
elementType: O N N N C C C C C C C
charge: 0.017865 -0.336092 0.005759 0.015141 0.289308 -0.130983 -0.074112 0.027370 0.025718 -0.025569 0.185596
polarizability: 2.09431261e+02 -1.24689106e-01 1.02090144e+02 -1.37754250e+00 1.27290676e+00 4.46176025e+01
1716.lowfreq: -11.0712 -7.5659 -0.0011 -0.0004 -0.0002 5.8614 45.2958 73.2094 102.1904
frequency: 45.2915 73.2076 102.1781 121.3340 185.9785 231.9971 286.1046 319.0695 406.2530 413.5173 468.2930 521.4579 585.5867 613.3202 653.8909 693.2275 772.4014 777.4228 805.2926 844.0409 905.1727 920.1319 976.3983 984.6645 991.3889 1014.2924 1019.0983 1080.2407 1113.8027 1161.2736 1170.1235 1181.0864 1213.2733 1284.4968 1315.5892 1341.0458 1385.0663 1412.2978 1435.3715 1447.5082 1451.2261 1477.6429 1491.9300 1584.1760 1606.0997 2595.9873 2989.3510 3090.6486 3126.7928 3135.4069 3136.9237 3150.8127 3162.3810 3171.4668
redmass: 3.9206 3.1785 4.4057 2.7377 1.4353 4.7189 5.2665 3.5633 2.9607 4.3391 9.2192 3.1574 6.9469 6.6654 5.9469 1.8671 1.8406 5.1210 1.0962 1.2489 5.8015 1.4632 1.3679 6.1166 1.3085 2.6915 2.1366 1.5270 1.3270 2.3803 1.0604 1.3609 2.5156 3.2887 1.3780 5.3395 7.1933 1.3392 1.6547 1.0515 1.9410 2.4274 1.1179 6.2110 6.0562 1.0538 1.0384 1.0954 1.0847 1.0885 1.1019 1.0931 1.0961 1.1000
irintensity: 2.7248 11.4565 0.6859 14.6192 12.0913 2.7780 10.1903 1.7801 0.4848 7.5366 38.9287 16.2160 20.6251 3.0895 12.8060 41.1818 56.7684 15.2616 130.4155 0.7750 15.4613 10.4254 0.0177 0.5036 1.0559 31.8954 5.6433 6.9161 51.7601 60.1574 0.1561 11.4049 17.3400 372.4193 8.3848 69.2300 4.8678 11.5424 58.9403 24.0691 13.1056 65.5686 0.4609 7.8608 18.3994 32.3551 74.0729 17.0241 3.4817 9.0928 7.7081 25.8538 24.7593 14.0141
temp: 298.150 k
press: 1.00000 atm
elementType: 8 7 7 7 6 6 6 6 6 6 6 1 1 1 1 1 1 1 1 1
symmnumber: 1
zpe: 403398.9 jmol-1
zpe.correction: 0.153647 hartree
zpe.thermalcorrener: 0.163903 hartree
zpe.thermalcorrenthalpy: 0.164847 hartree
zpe.thermalcorrgfe: 0.117007 hartree
zpe.sumelectzpe: -510.712729 hartree
zpe.sumelectthermal: -510.702473 hartree
zpe.sumelectthermalent: -510.701529 hartree
zpe.sumelectthermalfe: -510.749368 hartree
dipole: 0.7386 -1.4317 0.5058
dipole: 1.6885
quadrupole: -51.3021 -59.8516 -68.5317
quadrupole: -7.4192 1.4950 0.3507
quadrupole: 8.5930 0.0435 -8.6365 -7.4192 1.4950 0.3507
hfenergy: -510.8663758 hartree
pointgroup: C01 [X(C7H9N3O1)]
dipole: 0.2529673 -0.5078758 0.3455135 debye
dipolederiv: -0.5551226 -0.0213286 -0.0122681 -0.8305289 -0.5456773 0.0924459 -0.0555216 0.041084 -0.3411919 -1.0302223 0.0351452 -0.039015 0.8789808 -0.2102516 0.0327069 -0.2462513 0.0124637 -0.2009187 -1.2270791 0.25659 -0.1034028 0.7738025 0.440236 -0.1326982 0.6606327 -0.2023336 -0.0889429 1.3717573 -0.3049275 0.0596935 -0.4650507 -0.2870305 0.0604869 -0.1256079 0.1137261 -0.0857737 1.012337 0.0342509 0.0206104 -0.0270141 0.0347769 0.0017024 0.0159536 -0.0022114 0.0607186 -0.2893524 0.0471785 -0.016392 0.1307026 0.0372205 -0.0424118 -0.0161092 -0.0439697 -0.1716871 -0.1893323 -0.0394935 0.0043283 -0.1684857 -0.0527264 -0.0245692 0.0222768 -0.0200785 -0.1544593 0.1523826 -0.0623125 0.0203933 -0.1107209 0.0875593 -0.0510001 0.0275298 -0.0486507 -0.1379235 -0.0436196 0.0397778 -0.0075679 0.1621271 0.1282703 -0.0496003 -0.0328353 -0.0530529 -0.1339207 -0.0456444 0.0239062 -0.0041233 -0.0938643 -0.112107 -0.0186971 0.0218662 -0.0127819 -0.179754 0.6454723 -0.114317 0.1304983 -0.4397279 0.1368734 -0.01706 -0.0404206 0.0332112 0.281719 0.062632 -0.0898223 0.0170895 -0.063359 -0.0425349 0.0408042 0.0110601 0.0405316 0.1562823 0.058569 0.0849023 -0.0174775 0.0639587 0.0109083 0.0320953 -0.0104636 0.0324158 0.158566 -0.0063711 0.0967496 -0.0240786 0.1232655 -0.047114 0.0448796 -0.0296049 0.0435331 0.147727 0.022306 -0.0766315 0.0120575 -0.107081 -0.0845191 0.0452956 0.0209371 0.0455112 0.144729 -0.1410729 -0.0220116 -0.0025673 -0.0267347 0.0898503 0.0154252 -0.0003179 0.0152124 0.1658011 -0.0924836 0.0477179 -0.0537692 0.0506179 0.0563368 -0.0891304 -0.2271759 -0.027095 -0.1083296 -0.0855868 0.0377386 0.0535841 -0.0142629 0.1231782 0.0295269 0.1046309 0.0121795 0.0214031 0.0859367 -0.0807102 -0.0142399 -0.0026524 -0.0359793 0.0146522 -0.0273489 0.0120363 0.1263294 0.2944943 0.1075977 -0.0233531 0.1660273 0.2727301 0.015146 -0.07323 0.0082687 0.3396256 unknown
polarizability: 208.9509725|-3.986657|99.4253124|6.9997016|-12.7414699|47.7627224 unknown
InChI: InChI=1S/C7H9N3O/c1-10(11)9-8-7-5-3-2-4-6-7/h2-6,11H,1H3
charge 0 multiplicity 1
20 atoms
O  3.127419 1.198106 -0.150442
N  0.815895 0.452003 -0.020025
N  2.894041 -0.198268 0.106631
N  1.60792 -0.585218 0.257492
C  -0.581311 0.206939 -0.001578
C  -1.418228 1.327898 -0.250113
C  -1.168568 -1.066926 0.245724
C  -2.820659 1.180977 -0.248195
C  -2.570654 -1.201773 0.244016
C  -3.405581 -0.083401 -0.001194
C  4.002324 -0.925764 0.711003
H  -0.952788 2.300946 -0.440692
H  -0.521128 -1.92896 0.432863
H  -3.456748 2.052167 -0.440391
H  -3.018302 -2.184205 0.433478
H  -4.494957 -0.197687 -0.001301
H  4.242643 -0.52452 1.713489
H  4.887369 -0.835544 0.06187
H  3.701003 -1.981208 0.791481
H  2.105812 1.464638 -0.245314
