program: Gaussian 09
title: 000079853
version: EM64L-G09RevD.01
frameworkgroup: C1[X(C7H3Cl2NO4S)]
method: RPBEPBE
basis: SDD
operation: Freq
keyword: #p
keyword: freq=noraman
keyword: PBEPBE/SDD
title: #p freq=noraman PBEPBE/SDD
converged: NO NO NO NO
title: Mulliken charges:
elementType: Cl Cl S O O O O N C C C C C C C H H H
charge: 0.056204 -0.177598 0.898588 -0.219576 -0.428517 -0.456866 -0.149115 -0.468088 0.323996 0.217828 -0.044275 -0.319060 -0.289600 -0.097519 0.178800 0.331042 0.283897 0.359859
chargesum: 0.00000
title: Mulliken charges with hydrogens summed into heavy atoms:
elementType: Cl Cl S O O O O N C C C C C C C
charge: 0.056204 -0.177598 0.898588 -0.219576 -0.428517 -0.456866 -0.149115 -0.108229 0.323996 0.217828 -0.044275 0.011981 -0.005703 -0.097519 0.178800
polarizability: 2.38742766e+02 6.42893118e+00 1.34868696e+02 1.96537299e+00 3.62943844e+00 9.25546264e+01
1716.lowfreq: -4.8149 -3.4476 -0.0031 -0.0019 -0.0006 8.7682 36.9350 62.2841 95.1516
frequency: 36.8388 62.2652 95.1509 109.3817 133.2004 169.1009 183.1658 201.8646 233.4009 240.0401 263.7761 290.9901 331.4274 370.1234 391.1176 420.1051 437.3458 453.5264 557.1690 594.4515 610.2105 631.9592 677.4536 684.0321 700.0960 731.5173 795.7775 823.4139 835.5435 863.5314 893.7486 902.6393 959.2560 1055.2278 1068.9595 1175.9813 1223.4593 1265.8795 1310.7246 1381.0159 1425.4199 1474.8379 1605.9634 1625.5268 1774.5117 3175.7286 3181.7767 3609.7272
redmass: 21.9275 11.1427 11.0356 12.8396 15.7609 16.9327 19.6502 14.1281 10.7240 22.1672 11.9349 6.1067 16.6068 13.3852 14.3135 5.3194 10.4215 5.2573 5.8135 8.5170 1.1896 9.4194 9.2589 8.2126 8.8186 3.6073 10.3803 17.6703 6.8061 1.5745 1.4193 4.9071 19.7983 6.1577 2.1483 3.6192 1.5739 2.1442 2.5136 6.4530 2.9643 6.0576 8.9903 7.9689 11.2521 1.0936 1.0942 1.0813
irintensity: 0.8562 0.4515 3.7961 1.1213 1.7942 1.1788 0.5960 4.2075 1.5023 0.9401 1.8336 9.4206 0.6623 20.5092 61.0789 29.2939 34.1318 84.3377 12.4874 15.0273 106.1499 1.5678 0.4332 40.5640 28.6442 0.3866 110.5276 68.5952 4.0261 25.2725 35.5820 37.4886 39.2660 21.4949 36.5447 46.3095 53.5967 40.5841 107.3628 4.7586 42.5817 224.3242 23.4280 59.0931 910.7595 23.4757 1.2189 124.7031
temp: 298.150 k
press: 1.00000 atm
elementType: 17 17 16 8 8 8 8 7 6 6 6 6 6 6 6 1 1 1
symmnumber: 1
zpe: 251445.2 jmol-1
zpe.correction: 0.095770 hartree
zpe.thermalcorrener: 0.109618 hartree
zpe.thermalcorrenthalpy: 0.110562 hartree
zpe.thermalcorrgfe: 0.053775 hartree
zpe.sumelectzpe: -1941.142380 hartree
zpe.sumelectthermal: -1941.128532 hartree
zpe.sumelectthermalent: -1941.127588 hartree
zpe.sumelectthermalfe: -1941.184376 hartree
dipole: -4.3056 5.1411 0.1490
dipole: 6.7076
quadrupole: -131.7005 -104.3815 -110.7354
quadrupole: -13.2713 1.6544 1.0872
quadrupole: -16.0947 11.2243 4.8704 -13.2713 1.6544 1.0872
hfenergy: -1941.2381506 hartree
pointgroup: C01 [X(C7H3Cl2N1O4S1)]
dipole: -1.7068906 2.0109641 -0.0815017 debye
dipolederiv: -0.2458577 -0.2869524 0.0155533 -0.223703 -0.3559265 0.0220751 -0.023852 -0.0022802 0.0246893 -0.4695315 0.05177 -0.1436606 -0.0307941 -0.2205661 -0.1079855 -0.4139355 -0.003014 -0.7037874 1.9127171 -0.3836559 0.2174769 -0.3419734 1.1282283 0.1011484 0.2294555 0.0640372 1.5776137 -1.5526894 -0.1275948 0.0146123 0.1809449 -0.3804178 -0.0116511 0.0853235 -0.0125137 -0.1562064 -0.6058442 0.0906885 0.0271329 0.0455105 -0.3764068 0.0721585 0.0738568 0.005207 -0.5249149 -0.5539621 0.0168718 -0.0545407 0.0975775 -0.5641829 -0.0927591 0.0268408 -0.0375065 -0.4218624 -1.748996 -0.2709445 0.0082654 -0.3270464 -0.4448473 -0.0004769 0.0477705 0.0097355 -0.3211561 -1.4903599 -0.1273365 -0.0096157 -0.4973116 -0.5781297 0.0018652 0.0201518 0.0015478 -0.3244885 1.3246308 -0.0399846 -0.006675 -0.4069187 0.0333836 -0.0098949 -0.0695768 -0.0004172 0.0947941 0.5883385 0.3764935 -0.0056009 0.9342345 0.1224373 0.000049 -0.0470223 0.0023959 0.06527 -0.5278272 0.033233 0.0147697 0.0279884 -0.2953566 0.0147626 0.2616187 -0.0724435 -0.1481251 0.1088707 -0.1400519 -0.022558 0.2702216 -0.1325073 0.0274684 -0.1267487 0.0457334 -0.0855874 -0.4244294 -0.1363377 -0.0023401 -0.1103544 -0.060807 0.0195808 0.0268843 -0.0006022 -0.094905 0.4392869 0.5419845 -0.0488344 0.0510091 0.6763251 -0.0443939 -0.0576106 0.0222067 -0.0569544 2.7716464 0.4205017 -0.0324988 0.4551083 1.0423713 0.0212219 -0.0668733 -0.0016235 0.344212 0.1805137 0.019308 0.0228747 -0.0355526 0.1339406 -0.0033664 0.0096673 -0.0091723 0.1710006 0.0552659 0.0297806 -0.000399 0.027857 0.0309344 -0.0037282 0.0227555 -0.0088667 0.1846622 0.2382274 -0.0677732 0.0060379 -0.1167976 0.2415275 -0.0060742 0.0012946 -0.0024236 0.3757457 unknown
polarizability: 238.0011199|7.0764899|135.1128435|9.8246615|3.070244|93.0521248 unknown
InChI: InChI=1S/C7H3ClNO4S.Cl/c8-3-1-4-5(13-7(10)9-4)2-6(3)14(11)12;/h1-2,9H;
charge 0 multiplicity 1
18 atoms
Cl 2.154721 2.530431 -0.050012
Cl 3.595408 -0.296143 2.007111
S  2.822706 -0.797603 -0.224654
O  -2.442069 -1.2930 -0.013125
O  3.762729 -0.008691 -1.273469
O  2.646503 -2.404653 -0.325992
O  -4.728916 -0.634884 0.092692
N  -2.920892 0.940166 0.064624
C  -1.526762 0.835258 0.007649
C  -1.243009 -0.557562 -0.039008
C  1.079406 -0.076127 -0.126574
C  0.055451 -1.05219 -0.100313
C  -0.500993 1.791812 -0.005888
C  0.829147 1.312086 -0.067666
C  -3.537791 -0.327405 0.0519
H  0.286979 -2.120375 -0.134158
H  -0.693669 2.866425 0.036141
H  -3.470251 1.796554 0.110942
