program: Gaussian 09
title: 000079836
version: EM64L-G09RevD.01
frameworkgroup: C1[X(C13H10N2O3)]
method: RPBEPBE
basis: SDD
operation: Freq
keyword: #p
keyword: freq=noraman
keyword: PBEPBE/SDD
title: #p freq=noraman PBEPBE/SDD
converged: YES YES NO NO
title: Mulliken charges:
elementType: O O O N N C C C C C C C C C C C C C H H H H H H H H H H
charge: -0.242579 -0.440796 -0.255410 -0.468833 0.004486 0.511729 -0.444511 -0.330796 0.264663 -0.336007 -0.324700 0.228072 0.139103 -0.282305 -0.420720 0.106652 -0.185795 -0.319094 0.224788 0.312996 0.314749 0.272930 0.276203 0.235849 0.285686 0.238171 0.250404 0.385066
chargesum: 0.00000
title: Mulliken charges with hydrogens summed into heavy atoms:
elementType: O O O N N C C C C C C C C C C C C C
charge: -0.242579 -0.055730 -0.255410 -0.154085 0.004486 0.511729 -0.219723 -0.017800 0.264663 -0.063077 -0.048496 0.228072 0.139103 -0.046456 -0.135034 0.106652 0.052376 -0.068690
polarizability: 3.17966390e+02 6.64400273e-01 1.57755791e+02 -2.46910916e+00 1.76673209e+00 6.96192646e+01
1716.lowfreq: -5.5971 -2.8079 0.0003 0.0003 0.0012 5.8921 29.2256 35.1938 58.6134
frequency: 29.1666 35.1443 58.6082 72.0331 83.3509 121.2272 142.5257 192.1078 202.4275 255.8968 307.4107 331.9991 376.0010 393.6733 408.0925 413.9686 474.8435 500.5915 510.0233 579.1757 589.1404 610.3752 629.1971 650.4095 680.8987 687.8092 703.9777 721.5473 731.8196 763.7473 813.6323 830.4514 844.2516 864.8241 885.8076 931.6613 956.5189 982.8064 986.6141 997.5399 999.8553 1012.3322 1020.9870 1025.8496 1085.4236 1123.2904 1128.0295 1151.7250 1195.7208 1202.8115 1247.1223 1263.1751 1304.7419 1310.2979 1324.9055 1330.1615 1371.9471 1405.9126 1424.0764 1452.1897 1494.5736 1506.4336 1546.0319 1578.9207 1586.1969 1608.4058 1624.5192 1640.1740 3117.6816 3124.3869 3140.4784 3155.6912 3164.3960 3171.0183 3174.0387 3201.4507 3525.3020 3534.2775
redmass: 6.7248 5.2201 7.9294 7.3325 5.6703 5.4813 6.3908 5.3165 8.4011 5.7994 4.7522 7.5909 3.1806 7.5655 4.3629 3.1763 6.0963 5.2011 2.8860 5.2945 1.2275 7.5033 7.0834 1.2537 5.4449 3.6328 6.4803 1.7659 5.5562 4.4582 2.4779 3.4172 1.4059 6.7476 1.5061 1.3662 1.5060 1.3657 1.4599 3.9135 3.9792 1.3345 3.7177 3.2397 2.6207 1.4233 1.6014 1.6219 1.1859 1.2921 2.9834 2.0235 3.2641 2.0797 2.8770 1.2752 4.4769 2.2506 4.4019 2.0726 2.1939 2.9932 5.2882 5.7749 6.2454 4.4404 6.6051 8.4433 1.0899 1.0896 1.0902 1.0926 1.0949 1.0996 1.0909 1.0957 1.0760 1.0642
irintensity: 0.1307 2.8465 2.5595 1.8750 0.0778 4.3089 2.7051 0.1302 0.0184 2.8380 1.9810 1.8295 7.9340 16.3558 11.6153 0.9674 11.3804 10.3161 51.2988 20.7979 69.9700 2.1161 1.0576 42.2273 27.9330 82.1960 2.0279 57.7888 3.9042 25.1882 15.4470 7.1916 29.2869 16.1805 57.2221 3.9144 4.6661 0.2863 6.0958 145.0428 47.7287 1.3877 127.4113 93.4203 17.2699 18.4545 1.7079 186.9493 6.6996 5.2183 125.9420 41.5483 43.9322 68.1627 168.4211 9.6353 166.0782 12.8551 28.5916 13.3895 349.3473 305.3071 13.5917 33.1921 36.0573 122.8162 154.9272 318.4200 14.5743 9.6318 14.4405 3.2676 2.9825 21.1878 0.6551 4.4037 12.1594 56.5905
temp: 298.150 k
press: 1.00000 atm
elementType: 8 8 8 7 7 6 6 6 6 6 6 6 6 6 6 6 6 6 1 1 1 1 1 1 1 1 1 1
symmnumber: 1
zpe: 542062.8 jmol-1
zpe.correction: 0.206461 hartree
zpe.thermalcorrener: 0.221438 hartree
zpe.thermalcorrenthalpy: 0.222382 hartree
zpe.thermalcorrgfe: 0.162334 hartree
zpe.sumelectzpe: -835.327899 hartree
zpe.sumelectthermal: -835.312922 hartree
zpe.sumelectthermalent: -835.311978 hartree
zpe.sumelectthermalfe: -835.372026 hartree
dipole: 1.5208 3.8952 0.5662
dipole: 4.2197
quadrupole: -108.8959 -101.3889 -106.6508
quadrupole: 27.1127 2.0235 1.0172
quadrupole: -3.2507 4.2563 -1.0056 27.1127 2.0235 1.0172
hfenergy: -835.5343601 hartree
pointgroup: C01 [X(C13H10N2O3)]
dipole: 0.5771402 1.5389133 0.2340942 debye
polarizability: 317.9043016|2.9498186|157.7723727|-2.9902358|2.4436252|69.6647716 unknown
InChI: InChI=1S/C13H10N2O3/c16-12(10-2-1-7-14-8-10)15-11-5-3-9(4-6-11)13(17)18/h1-8,15,17H
charge 0 multiplicity 1
28 atoms
O  1.343311 -1.879319 0.139838
O  -5.633398 -1.226694 0.222157
O  -5.85975 1.054486 -0.152014
N  0.616603 0.345563 -0.099106
N  5.358031 -0.687813 -0.464567
C  -0.794516 0.200698 -0.06761
C  -1.57214 1.379789 -0.257363
C  -1.444806 -1.046925 0.14589
C  -3.62701 0.075846 -0.016077
C  -2.972186 1.317398 -0.232077
C  -2.850325 -1.09615 0.170915
C  3.016564 -0.131727 0.021122
C  1.600662 -0.643133 0.033972
C  3.405467 1.157631 0.467819
C  4.036805 -1.01681 -0.422787
C  -5.108865 0.058928 0.003831
C  4.771132 1.512321 0.43366
C  5.707215 0.565469 -0.042107
H  -1.072975 2.342991 -0.423933
H  -0.844822 -1.94767 0.280851
H  0.951673 1.293763 -0.285625
H  -3.580709 2.215708 -0.376371
H  -3.359856 -2.04962 0.334621
H  2.673353 1.86406 0.877717
H  3.767412 -2.026909 -0.748138
H  5.10864 2.493198 0.781469
H  6.776446 0.801472 -0.081031
H  -6.626056 -1.167751 0.222744
