program: Gaussian 09
title: 000079831
version: EM64L-G09RevD.01
frameworkgroup: C1[X(C7H19N3)]
method: RPBEPBE
basis: SDD
operation: Freq
keyword: #pfreq=noraman
keyword: PBEPBE/SDD
title: #p freq=noraman PBEPBE/SDD
converged: YES YES NO NO
title: Mulliken charges:
elementType: N N N C C C C C C C H H H H H H H H H H H H H H H H H H H
charge: -0.094815 -0.152802 -0.093475 -0.015436 -0.637413 -0.607798 -0.624692 -0.626492 -0.609943 -0.639306 0.201787 0.191836 0.254564 0.212358 0.213552 0.194149 0.216983 0.268308 0.212049 0.183418 0.212241 0.270152 0.183367 0.218629 0.193646 0.214277 0.254964 0.191779 0.214114
chargesum: 0.00000
title: Mulliken charges with hydrogens summed into heavy atoms:
elementType: N N N C C C C C C C
charge: -0.094815 -0.152802 -0.093475 0.186351 0.021345 0.016886 0.039083 0.039268 0.016609 0.021550
polarizability: 1.04937950e+02 1.65192397e-01 1.00948658e+02 -3.83006494e-01 9.37812770e-02 8.86771798e+01
1716.lowfreq: -26.1421 -11.6550 -0.0005 0.0005 0.0008 17.0127 35.8107 70.3222 95.3376
frequency: 32.8722 69.8010 95.3209 110.0514 150.1812 161.8832 171.2686 178.8011 219.7320 220.7819 232.7294 254.3015 298.2031 325.8938 342.7732 365.6446 371.7028 408.0772 472.7630 504.3902 569.6815 835.6755 843.9469 880.6961 998.8092 1004.4114 1023.4367 1030.8434 1049.6026 1057.2084 1091.9578 1095.3267 1097.0317 1136.8972 1137.5516 1140.4509 1167.2615 1222.2095 1225.3289 1259.4947 1272.2756 1284.7075 1322.3307 1375.0510 1401.7965 1413.9644 1418.5615 1421.5178 1432.7511 1440.6628 1450.7909 1451.9284 1460.2811 1465.9757 1471.9341 1475.5276 1482.4861 1486.8740 1492.5777 1494.9543 1497.7963 1509.0932 2835.3960 2858.9953 2861.7777 2870.5400 2876.2744 2881.6013 2895.6632 2979.6493 2982.7927 2990.8512 2992.0339 3024.7015 3027.9067 3055.6611 3058.7507 3085.9130 3088.9784 3121.1917 3123.4969
redmass: 2.6309 1.9800 2.2369 2.3483 1.5416 1.1128 1.7078 1.1460 1.2396 1.2320 1.9680 2.4878 1.0507 2.3493 2.9405 2.4377 2.7561 2.5722 3.0257 3.4238 3.6187 4.2835 3.8763 4.4231 2.4210 2.1932 2.2705 1.5023 1.3807 1.4508 1.2344 1.2425 1.2495 1.4182 1.3767 1.4233 3.4492 4.3950 2.9188 2.4497 2.4868 2.6481 1.6441 1.2549 1.1251 1.1361 1.1366 1.1357 1.1391 1.1429 1.0623 1.0564 1.0642 1.0530 1.0821 1.0530 1.0473 1.0531 1.0522 1.0709 1.0542 1.0567 1.0803 1.0576 1.0555 1.0574 1.0532 1.0537 1.0521 1.0780 1.0829 1.0785 1.0825 1.0775 1.0762 1.0973 1.0972 1.0948 1.0945 1.0950 1.0956
irintensity: 1.8709 2.6573 0.5386 0.9560 0.1742 0.4098 3.5481 3.2330 2.6629 1.4075 1.0189 7.4985 0.2306 2.7563 1.6402 0.0261 6.3931 16.5135 4.3867 12.1657 12.2084 16.2269 4.6332 14.6076 164.3159 48.8370 223.8887 1.2717 1.2717 5.3178 1.1203 6.5018 0.6855 5.8063 1.1149 3.0927 3.7061 42.3344 40.7251 14.1181 22.7198 11.6188 40.0782 7.1127 7.4617 1.6453 30.3048 17.0253 15.5355 8.4219 5.9085 0.0477 10.5333 45.8422 12.7221 0.1286 0.2737 6.5920 30.8316 12.1241 18.9689 6.2802 49.7734 48.0938 1.9788 292.8243 195.8159 1.4418 244.5039 179.9423 17.7559 56.7959 21.2719 10.2192 94.6215 23.6970 53.2691 8.9107 17.7905 21.9480 10.4283
temp: 298.150 k
press: 1.00000 atm
elementType: 7 7 7 6 6 6 6 6 6 6 1 1 1 1 1 1 1 1 1 1 1 1 1 1 1 1 1 1 1
symmnumber: 1
zpe: 681817.6 jmol-1
zpe.correction: 0.259691 hartree
zpe.thermalcorrener: 0.273719 hartree
zpe.thermalcorrenthalpy: 0.274663 hartree
zpe.thermalcorrgfe: 0.219806 hartree
zpe.sumelectzpe: -441.467821 hartree
zpe.sumelectthermal: -441.453793 hartree
zpe.sumelectthermalent: -441.452848 hartree
zpe.sumelectthermalfe: -441.507706 hartree
dipole: -0.7969 -0.0703 -0.4029
dipole: 0.8957
quadrupole: -63.2923 -64.9138 -64.1843
quadrupole: -0.0909 0.2984 0.1075
quadrupole: 0.8378 -0.7837 -0.0541 -0.0909 0.2984 0.1075
hfenergy: -441.7275118 hartree
pointgroup: C01 [X(C7H19N3)]
dipole: 0.3095911 0.0340764 -0.1648838 debye
polarizability: 104.9403748|0.2290772|100.9559308|0.0393619|-0.0002763|88.6674823 unknown
InChI: InChI=1S/C7H19N3/c1-8(2)7(9(3)4)10(5)6/h7H,1-6H3
charge 0 multiplicity 1
29 atoms
N  0.608078 1.272936 -0.031974
N  -1.429607 -0.01071 0.123444
N  0.609601 -1.286158 -0.07758
C  -0.045753 0.002275 -0.42607
C  0.741695 1.593371 1.395096
C  1.70966 1.753865 -0.869559
C  -2.204471 1.211771 -0.182071
C  -2.204399 -1.21811 -0.239285
C  1.769151 -1.662623 -0.893865
C  0.738626 -1.641487 1.344313
H  -0.047498 0.021725 -1.547845
H  1.676792 1.195773 1.856518
H  -0.121281 1.174481 1.938472
H  0.745213 2.693427 1.536783
H  1.511835 1.510917 -1.929616
H  2.705992 1.325212 -0.601102
H  1.795285 2.856181 -0.786438
H  -1.624429 2.104432 0.090403
H  -3.147134 1.195257 0.395164
H  -2.466879 1.29135 -1.267415
H  -3.137292 -1.241868 0.353369
H  -1.612473 -2.119903 -0.029927
H  -2.484086 -1.235497 -1.323011
H  1.93579 -2.755793 -0.827187
H  2.721157 -1.162968 -0.588603
H  1.580775 -1.414412 -1.954548
H  -0.152031 -1.281226 1.885096
H  1.645516 -1.210425 1.831314
H  0.795667 -2.743194 1.451526
