program: Gaussian 09
title: 000079977
version: EM64L-G09RevD.01
frameworkgroup: C1[X(C18H17NO6)]
method: RPBEPBE
basis: SDD
operation: Freq
keyword: #p
keyword: freq=noraman
keyword: PBEPBE/SDD
title: #p freq=noraman PBEPBE/SDD
converged: YES YES NO NO
title: Mulliken charges:
elementType: O O O O O O N C C C C C C C C C C C C C C C C C C H H H H H H H H H H H H H H H H H
charge: -0.284420 -0.252779 -0.278613 -0.254654 -0.451471 -0.248674 -0.474372 0.346861 -0.655237 0.143601 0.310024 0.156260 0.134717 -0.469497 0.300333 -0.308231 -0.360778 -0.306396 -0.355376 0.333355 -0.371587 -0.351283 0.088549 -0.528682 -0.536202 0.274845 0.274777 0.429214 0.346868 0.241333 0.273568 0.256324 0.277388 0.259107 0.247972 0.251850 0.226017 0.226127 0.228351 0.228512 0.252659 0.379640
chargesum: 0.00000
title: Mulliken charges with hydrogens summed into heavy atoms:
elementType: O O O O O O N C C C C C C C C C C C C C C C C C C
charge: -0.284420 -0.252779 -0.278613 -0.254654 -0.071831 -0.248674 -0.045158 0.346861 -0.105614 0.143601 0.310024 0.156260 0.134717 -0.122630 0.300333 -0.066899 -0.087210 -0.050072 -0.077988 0.333355 -0.112480 -0.103311 0.088549 0.175313 0.173320
polarizability: 3.99947642e+02 -9.47258699e+00 2.50705739e+02 2.79403626e-02 8.36299039e-02 9.97214640e+01
1716.lowfreq: -2.2482 -0.0006 -0.0003 0.0010 1.6944 4.9191 12.4634 29.4422 40.2227
frequency: 11.3537 29.3199 40.2105 44.6903 53.0237 70.7093 75.8660 90.5910 100.4574 103.6300 115.3194 133.1568 138.8347 172.2852 202.5515 212.5426 216.7190 241.0966 249.7382 288.1407 297.2177 318.9961 336.5383 341.6494 355.1110 398.0360 414.5978 457.5630 462.5397 474.1951 495.7118 525.0684 530.2704 534.6665 545.5946 583.7965 589.9702 608.5264 627.3545 638.2790 668.8720 679.7991 721.6917 738.0204 750.9324 764.9967 784.8341 820.0040 821.6035 825.6831 838.5783 906.0302 920.0658 928.8695 956.9826 966.9174 973.9938 978.4889 980.3398 988.8416 990.6750 994.5974 1015.0550 1036.3437 1112.1389 1115.0761 1116.1410 1118.4951 1144.7160 1158.0134 1160.3532 1175.7084 1203.0052 1205.3262 1215.8893 1239.1866 1246.3252 1259.6266 1276.1092 1304.8588 1319.8871 1328.2573 1374.4622 1399.5228 1409.9051 1432.1161 1433.6452 1438.6836 1441.3469 1468.4735 1469.4000 1469.5643 1470.4034 1488.3920 1502.7892 1526.2083 1554.9189 1577.6389 1591.5943 1609.1957 1617.3994 1623.4346 1648.6355 2969.1796 2971.3131 2992.9261 3039.1791 3061.0490 3064.7013 3133.8166 3135.2685 3150.2881 3150.8067 3158.8053 3170.0580 3175.5346 3184.7180 3191.7030 3227.9667 3532.9434
redmass: 5.2545 4.5971 6.0562 7.7483 10.9735 3.7183 3.2819 3.7735 6.6771 4.1712 6.6058 4.6177 4.6760 4.8869 4.2952 1.3869 1.1709 5.8351 2.6145 3.8249 5.9476 5.9501 6.9911 4.5163 8.2909 8.4400 2.9638 2.9265 6.5560 3.2573 5.0534 2.4642 5.7990 5.0184 1.9573 5.9492 5.4133 1.8116 7.1317 4.2485 5.3713 5.0459 4.3267 3.7461 5.8757 4.2972 5.8869 6.2505 1.5600 1.2486 1.6550 6.5238 1.8946 6.9200 1.3680 1.2418 1.3951 1.4387 8.7241 1.4068 8.5330 3.4257 2.4729 2.6248 1.2582 1.8357 1.2573 1.3504 1.4847 1.3417 1.4621 1.2863 1.1218 2.7099 2.3204 2.2853 3.0801 1.6284 2.3665 1.3645 2.4650 2.3098 4.8621 6.1291 1.1563 1.5549 2.4745 1.4473 2.8395 1.0506 1.1432 1.0598 1.0810 2.1755 2.4987 3.3725 4.4702 7.1457 7.4663 7.6216 3.8827 5.4183 8.4047 1.0325 1.0325 1.0613 1.0959 1.1044 1.1045 1.1001 1.1002 1.0879 1.0881 1.0881 1.0956 1.0969 1.0956 1.0932 1.0816 1.0641
irintensity: 0.1145 1.1955 1.2544 1.3763 0.0084 1.0508 12.4356 5.2834 0.4003 3.0613 2.3676 0.0366 7.4242 1.5214 5.5997 0.6398 0.0301 12.7160 2.1345 2.5695 4.7763 1.5980 12.9247 0.9876 8.5548 7.4617 0.1428 0.5605 40.7549 9.8429 13.1827 0.5983 76.7831 0.0098 79.5835 87.6552 27.5716 50.5042 3.7846 19.6699 1.2763 0.1222 47.7514 0.0582 9.2472 13.3738 2.0425 7.3394 27.7450 0.0522 77.9046 43.5223 14.8659 58.5014 2.2295 32.1124 34.4872 42.4932 58.4873 0.8379 55.0955 16.4103 1.7568 227.5953 0.1713 321.3233 0.5857 9.9194 45.7716 1.0407 13.8433 321.4060 2.9168 12.9082 86.5067 123.2720 168.9584 74.4367 46.3953 24.1100 124.0321 208.7075 101.7738 9.8569 88.5026 49.3429 1.2532 6.3606 105.8837 14.9636 85.7106 22.5613 78.9325 100.5435 6.8411 1042.4060 30.6428 81.1714 223.7525 51.6713 41.8295 214.9426 342.0289 66.8523 68.6162 15.5989 0.6735 40.3537 40.1355 14.5999 21.4920 0.2665 5.6165 8.9798 13.6800 5.5910 1.6449 13.2272 652.1366 46.3221
temp: 298.150 k
press: 1.00000 atm
elementType: 8 8 8 8 8 8 7 6 6 6 6 6 6 6 6 6 6 6 6 6 6 6 6 6 6 1 1 1 1 1 1 1 1 1 1 1 1 1 1 1 1 1
symmnumber: 1
zpe: 835802.3 jmol-1
zpe.correction: 0.318340 hartree
zpe.thermalcorrener: 0.342031 hartree
zpe.thermalcorrenthalpy: 0.342975 hartree
zpe.thermalcorrgfe: 0.262283 hartree
zpe.sumelectzpe: -1200.421966 hartree
zpe.sumelectthermal: -1200.398276 hartree
zpe.sumelectthermalent: -1200.397332 hartree
zpe.sumelectthermalfe: -1200.478024 hartree
dipole: -7.1069 6.6935 0.0175
dipole: 9.7628
quadrupole: -98.1307 -138.2144 -147.9447
quadrupole: 9.9367 -0.0822 0.0553
quadrupole: 29.9659 -10.1178 -19.8481 9.9367 -0.0822 0.0553
hfenergy: -1200.7403066 hartree
pointgroup: C01 [X(C18H17N1O6)]
dipole: 2.7062604 -2.4212318 1.2517342 debye
polarizability: 398.7960192|-8.4957977|223.6156571|15.6165847|-58.6788601|127.9631682 unknown
InChI: InChI=1S/C18H17NO6/c1-24-13-6-3-11(4-7-13)15(20)10-17(21)19-14-9-12(18(22)23)5-8-16(14)25-2/h3-9,19,22H,10H2,1-2H3
charge 0 multiplicity 1
42 atoms
O  -1.876987 -2.255627 0.790053
O  7.545658 0.388748 -0.077325
O  1.270162 -1.025605 0.33883
O  -1.099242 2.169804 -1.258945
O  -7.235724 0.854974 -0.865013
O  -5.680163 2.435379 -1.550466
N  -1.141315 0.040922 -0.259925
C  -2.535773 -0.196244 -0.200659
C  1.034904 1.181885 -0.712536
C  -2.939541 -1.44897 0.371962
C  3.324098 0.126559 -0.122408
C  1.839167 0.015857 -0.129955
C  -0.508747 1.161495 -0.762215
C  -3.531309 0.694639 -0.654761
C  -4.904267 0.344911 -0.541188
C  -4.303638 -1.79205 0.482648
C  -5.288494 -0.894184 0.025404
C  4.022785 1.261028 -0.633424
C  4.081873 -0.947555 0.418549
C  6.161949 0.231634 -0.058023
C  5.422509 1.315586 -0.603192
C  5.48585 -0.908164 0.456817
C  -5.910603 1.315214 -1.033058
C  -2.181478 -3.554218 1.394755
C  8.374713 -0.692525 0.472797
H  1.304072 2.109409 -0.169797
H  1.365485 1.360426 -1.754789
H  -0.514535 -0.701567 0.113366
H  -3.244005 1.652422 -1.093224
H  -4.602278 -2.74876 0.920375
H  -6.349458 -1.143817 0.102861
H  3.474783 2.107981 -1.058108
H  3.536498 -1.813518 0.807949
H  5.97129 2.178374 -0.991478
H  6.0405 -1.750567 0.88008
H  -1.202679 -3.98891 1.642354
H  -2.783821 -3.431771 2.314911
H  -2.715286 -4.209282 0.680266
H  8.22286 -1.634887 -0.086553
H  8.159878 -0.852108 1.546294
H  9.410547 -0.347075 0.34714
H  -7.848839 1.554857 -1.215769
