program: Gaussian 09
title: 000079839
version: EM64L-G09RevD.01
frameworkgroup: C1[X(C11H16N4O2)]
method: RPBEPBE
basis: SDD
operation: Freq
keyword: #p
keyword: freq=noraman
keyword: PBEPBE/SDD
title: #p freq=noraman PBEPBE/SDD
converged: NO YES NO NO
title: Mulliken charges:
elementType: O O N N N N C C C C C C C C C C C H H H H H H H H H H H H H H H H
charge: -0.269457 -0.268326 -0.412726 -0.165560 -0.081006 -0.219219 -0.018493 -0.546335 0.231522 0.113012 0.081216 0.122264 -0.695738 -0.722488 0.204193 -0.615462 -0.598953 0.219940 0.245236 0.210685 0.337526 0.231725 0.217441 0.208747 0.225800 0.225769 0.206344 0.245430 0.272142 0.246649 0.267702 0.250279 0.250140
chargesum: 0.00000
title: Mulliken charges with hydrogens summed into heavy atoms:
elementType: O O N N N N C C C C C C C C C C C
charge: -0.269457 -0.268326 -0.075200 -0.165560 -0.081006 -0.219219 0.192193 -0.081158 0.231522 0.113012 0.081216 0.122264 -0.037825 -0.064574 0.204193 0.148758 0.169168
polarizability: 2.09916725e+02 2.24719758e+00 1.62438196e+02 -1.25034844e+01 4.68882195e-01 9.65030129e+01
1716.lowfreq: -12.3645 -5.1740 -3.6638 0.0007 0.0007 0.0008 14.9496 49.2000 65.2785
frequency: 14.5436 48.9827 65.2654 81.6568 94.9594 108.9811 118.6818 143.9313 170.1902 187.0703 202.5354 243.6666 248.2984 293.0076 313.6303 326.5612 346.0120 357.9479 374.9703 378.0281 396.3668 406.4341 482.2363 490.8222 544.1360 639.4711 652.7250 667.6475 683.8890 704.4522 742.9301 758.8240 766.2169 792.7842 876.4790 921.0196 928.4392 947.8068 961.1668 965.4678 987.0873 1040.4652 1075.4363 1096.9407 1108.2171 1130.2677 1131.9704 1181.9896 1189.5004 1208.2336 1227.0662 1230.1458 1265.9225 1273.5955 1299.9991 1327.3495 1344.6342 1371.7125 1379.6477 1385.0524 1398.8325 1417.4504 1428.2763 1450.3046 1464.6175 1466.0724 1470.9175 1473.5198 1478.4886 1478.9824 1482.6156 1484.6237 1486.1019 1526.1542 1577.8600 1614.8784 1658.3821 2968.2290 2971.1506 2980.8287 2996.5457 3007.6124 3012.8423 3060.3658 3067.9831 3073.0732 3077.7744 3082.2702 3096.7822 3105.1615 3138.5311 3139.9627 3588.1483
redmass: 3.4009 4.1454 2.6852 1.0618 3.2982 1.3610 2.6657 4.7387 2.8136 4.1881 1.2091 1.8781 1.6677 2.8749 4.9755 3.4144 3.9365 3.2309 2.5694 3.3996 4.9520 4.3752 5.6803 5.9919 4.3225 5.7313 2.4800 2.3339 3.3969 11.1072 11.3703 5.3559 4.9471 2.8722 1.6287 1.2071 4.2633 2.4545 1.5650 2.8511 4.4943 3.0937 1.7203 1.5515 3.5255 1.2979 1.3031 1.9805 2.9402 1.8594 2.6180 1.6574 4.8522 1.5219 3.8550 1.6162 1.3734 3.6662 1.5620 2.2052 1.2155 1.3038 1.3191 1.2572 1.8525 1.0656 1.0781 1.0447 1.0506 1.0709 1.4218 1.0463 1.0640 4.0413 8.2511 10.4604 10.4024 1.0380 1.0791 1.0364 1.0653 1.0336 1.0327 1.0992 1.0992 1.0991 1.0994 1.0992 1.1025 1.1022 1.1025 1.1012 1.0821
irintensity: 0.0771 0.0387 0.0351 0.0024 0.0047 1.3436 3.2209 0.0879 3.3591 17.9486 3.0849 1.4261 0.4004 1.6833 1.1395 8.1669 12.3724 1.0040 7.0337 1.7701 20.7773 2.4547 20.8395 6.6682 3.9034 0.5574 31.0159 53.5243 28.1021 7.0119 10.8295 0.6270 0.7345 0.8638 2.4987 2.4112 5.4783 1.0494 3.6386 31.4432 4.7988 45.0097 6.3975 3.4575 19.3463 0.3987 0.0283 11.7911 39.0379 45.9103 6.3418 2.0656 25.5602 29.2102 75.4596 11.1989 43.0614 24.0507 40.3373 9.5682 15.7486 27.5324 67.9167 77.8415 93.6359 8.6253 4.0578 18.1307 9.8748 13.1755 114.9813 16.9103 25.4295 58.4787 6.5802 561.7760 451.9388 29.2194 22.8566 25.9830 40.4353 34.8093 28.2607 31.9725 12.9811 14.2415 53.4885 71.3150 18.2488 17.5942 0.7576 0.4794 65.9085
temp: 298.150 k
press: 1.00000 atm
elementType: 8 8 7 7 7 7 6 6 6 6 6 6 6 6 6 6 6 1 1 1 1 1 1 1 1 1 1 1 1 1 1 1 1
symmnumber: 1
zpe: 702380.2 jmol-1
zpe.correction: 0.267523 hartree
zpe.thermalcorrener: 0.284822 hartree
zpe.thermalcorrenthalpy: 0.285766 hartree
zpe.thermalcorrgfe: 0.221409 hartree
zpe.sumelectzpe: -796.998619 hartree
zpe.sumelectthermal: -796.981320 hartree
zpe.sumelectthermalent: -796.980375 hartree
zpe.sumelectthermalfe: -797.044733 hartree
dipole: 4.7568 0.0120 -0.6590
dipole: 4.8022
quadrupole: -99.4981 -107.2992 -99.9696
quadrupole: -2.0716 -0.6602 0.5192
quadrupole: 2.7575 -5.0436 2.2861 -2.0716 -0.6602 0.5192
hfenergy: -797.2661418 hartree
pointgroup: C01 [X(C11H16N4O2)]
dipole: 1.8737189 -0.0282576 0.2408226 debye
polarizability: 210.0941055|-2.9181675|162.4662812|11.3702917|1.3420931|96.2975473 unknown
InChI: InChI=1S/C11H16N4O2/c1-6(2)5-7-12-8-9(13-7)14(3)11(17)15(4)10(8)16/h6,12H,5H2,1-4H3
charge 0 multiplicity 1
33 atoms
O  -1.548645 2.815664 0.098445
O  -3.725623 -1.342754 -0.437366
N  1.01532 1.127327 0.592599
N  -1.425823 -1.384729 0.032089
N  0.992137 -1.1440 0.54278
N  -2.623782 0.709355 -0.168019
C  4.165617 0.009339 -0.240079
C  3.23826 -0.044413 1.022214
C  1.767846 -0.033333 0.727054
C  -0.301824 0.754975 0.307692
C  -0.279521 -0.646717 0.283552
C  -1.479049 1.547209 0.084606
C  3.988843 -1.239712 -1.132847
C  3.9727 1.313147 -1.048971
C  -2.652174 -0.71574 -0.20665
C  -1.380561 -2.859662 0.010262
C  -3.922812 1.375882 -0.418176
H  3.488236 0.807807 1.683977
H  3.454322 -0.97303 1.57942
H  5.202144 0.004938 0.157241
H  1.342876 2.0893 0.677032
H  2.96133 -1.301067 -1.534189
H  4.177204 -2.169079 -0.565109
H  4.69121 -1.208571 -1.985818
H  4.710284 1.372414 -1.869661
H  2.966582 1.357104 -1.506369
H  4.106416 2.211533 -0.415451
H  -0.671283 -3.204368 -0.760687
H  -2.394367 -3.219495 -0.216576
H  -1.049646 -3.242996 0.989954
H  -3.748991 2.460323 -0.361631
H  -4.660901 1.061591 0.337556
H  -4.306227 1.095558 -1.412674
