program: Gaussian 09
title: 000079842
version: EM64L-G09RevD.01
frameworkgroup: C1[X(C16H27N)]
method: RPBEPBE
basis: SDD
operation: Freq
keyword: #pfreq=noraman
keyword: PBEPBE/SDD
title: #p freq=noraman PBEPBE/SDD
converged: YES YES NO NO
title: Mulliken charges:
elementType: N C C C C C C C C C C C C C C C C H H H H H H H H H H H H H H H H H H H H H H H H H H H
charge: -0.117993 -0.364536 -0.352160 -0.359023 -0.363351 -0.366620 -0.577064 -0.329658 -0.326255 0.514534 -0.695094 -0.696662 -0.410695 -0.419392 -0.230139 -0.227291 -0.244478 0.196962 0.193360 0.191015 0.193461 0.202905 0.218161 0.190539 0.186893 0.188306 0.187231 0.203039 0.218892 0.219210 0.182589 0.220717 0.182919 0.215401 0.206709 0.205124 0.215024 0.208587 0.204139 0.230644 0.232641 0.222379 0.222628 0.226400
chargesum: 0.00000
title: Mulliken charges with hydrogens summed into heavy atoms:
elementType: N C C C C C C C C C C C C C C C C
charge: -0.117993 0.025786 0.032316 0.062043 0.014081 0.008918 -0.155133 0.072141 0.077381 0.514534 -0.067859 -0.068911 -0.180051 -0.186751 -0.007760 -0.004663 -0.018079
polarizability: 2.20339863e+02 -4.25068193e+00 1.75345180e+02 -4.23597158e+00 -1.54924001e+01 1.40675040e+02
1716.lowfreq: -25.1822 -4.5751 -0.0007 -0.0003 0.0006 4.4053 9.2993 16.2946 26.0152
frequency: -13.0537 14.6150 25.9992 30.1594 47.3074 57.7449 76.5796 86.6626 90.3053 108.5843 189.7440 208.2259 222.0657 231.5543 245.8972 278.6498 281.9261 295.7738 322.5986 349.2670 382.1639 403.3369 406.0974 508.7363 519.8204 537.3771 585.3594 618.0464 703.7211 712.6883 739.2730 755.6312 767.5713 783.7081 814.2250 822.1372 823.7918 849.7590 853.8993 886.9987 916.2166 941.9030 944.1115 968.4260 975.1449 989.8383 992.5539 1007.6173 1016.7555 1025.1091 1029.1293 1049.8681 1055.4679 1085.1486 1085.8422 1099.4424 1112.0101 1118.9293 1141.3944 1171.0801 1179.5782 1185.2712 1211.0962 1216.3435 1226.9425 1239.1769 1252.9051 1264.6133 1279.3720 1283.6535 1286.5119 1295.1229 1305.4973 1307.5936 1325.1417 1349.5146 1353.9981 1362.4220 1364.2897 1375.8859 1382.0473 1388.6332 1390.7838 1439.8147 1455.3457 1456.8916 1470.7822 1470.8885 1472.7971 1475.2090 1476.3813 1477.6356 1478.4746 1483.0319 1483.3841 1487.1435 1487.5204 1592.2976 1613.9626 2847.8848 2852.3953 2867.1649 2963.3847 2964.0609 2968.9529 2969.5700 2970.5578 2970.9344 2994.2520 3004.8032 3005.5451 3022.3829 3025.9174 3033.1990 3037.0683 3038.3976 3060.7203 3066.3674 3067.1969 3068.7814 3069.2266 3112.0230 3113.6143 3129.8015 3141.4995 3160.6358
redmass: 2.9748 3.5655 3.6636 3.2573 3.1399 2.0245 2.2893 2.3392 2.4810 2.5105 3.3686 2.9152 1.2469 1.2115 2.1674 2.1668 2.1833 2.2824 2.6850 2.9203 2.3964 2.7956 2.6290 2.9894 2.5745 2.9328 4.0304 6.3624 1.9452 1.5232 1.1379 1.5891 1.8210 1.2321 2.1101 1.9261 2.8243 1.3756 1.2504 1.4416 1.4761 1.4377 1.4111 1.6987 1.3898 6.2121 1.3222 2.3463 1.8952 2.4552 2.9920 2.4977 2.5568 1.8706 1.8546 1.7721 2.1485 1.9071 1.6850 1.0530 2.2585 1.1145 1.5814 2.2572 1.3533 1.4131 1.2978 1.3950 1.1418 1.1669 1.2519 1.2854 1.2958 1.2862 1.2615 1.5908 1.5668 1.3169 1.3306 1.3638 7.6619 1.2148 1.2168 2.1764 1.0827 1.0843 1.0680 1.0919 1.0860 1.0819 1.0482 1.0493 1.0445 2.2543 1.0896 1.0863 1.0857 6.0570 6.1917 1.0717 1.0713 1.0706 1.0583 1.0579 1.0381 1.0395 1.0631 1.0632 1.0606 1.0944 1.0934 1.0888 1.0906 1.0892 1.0985 1.0984 1.1016 1.1008 1.1008 1.0990 1.0989 1.0871 1.0869 1.0907 1.0958 1.1014
irintensity: 0.0095 0.0054 0.0097 0.0117 0.0656 0.0674 0.1739 0.0817 0.3853 0.5040 0.6908 1.5662 0.2145 0.1089 0.4529 0.1791 0.4725 0.0915 1.8973 3.3381 0.4762 0.1330 0.9124 17.3263 2.1054 6.8812 10.8385 0.0620 39.8876 14.5347 7.5508 28.7339 20.9304 3.4638 1.0099 0.4284 5.2494 1.9087 0.0009 0.4803 2.2642 10.6111 15.3333 5.9174 0.1328 0.0445 0.0334 5.3187 5.0256 2.2431 8.5023 2.3079 22.9743 22.7120 21.8344 21.1528 8.5095 14.1872 18.8145 0.2286 21.4393 0.3567 4.3189 0.6869 5.7344 9.0537 5.8984 8.6316 4.8402 0.6247 3.2524 6.1495 11.4705 5.8417 0.4757 4.3064 4.5071 7.7388 5.9311 0.7148 0.3204 11.1467 11.7647 7.1114 1.6647 3.3766 2.9900 6.2402 4.9449 10.1275 6.2113 4.2791 8.2277 21.3296 0.7330 24.2317 20.7855 1.5813 12.0234 24.3596 75.2282 200.2257 7.1781 19.0102 46.9649 39.9215 61.1930 79.5848 29.9339 10.7065 8.4634 14.9044 38.9325 17.3015 20.4752 47.8147 28.2053 91.9277 104.9438 38.7612 67.5476 10.5261 8.3891 11.2381 46.8471 25.9891
temp: 298.150 k
press: 1.00000 atm
elementType: 7 6 6 6 6 6 6 6 6 6 6 6 6 6 6 6 6 1 1 1 1 1 1 1 1 1 1 1 1 1 1 1 1 1 1 1 1 1 1 1 1 1 1 1
symmnumber: 1
zpe: 1032008.1 jmol-1
zpe.correction: 0.393071 hartree
zpe.thermalcorrener: 0.411860 hartree
zpe.thermalcorrenthalpy: 0.412804 hartree
zpe.thermalcorrgfe: 0.342873 hartree
zpe.sumelectzpe: -679.288694 hartree
zpe.sumelectthermal: -679.269905 hartree
zpe.sumelectthermalent: -679.268961 hartree
zpe.sumelectthermalfe: -679.338892 hartree
dipole: 0.2184 -0.1353 0.9067
dipole: 0.9424
quadrupole: -104.6509 -103.4434 -108.7525
quadrupole: -0.4766 0.8602 -3.2814
quadrupole: 0.9647 2.1722 -3.1369 -0.4766 0.8602 -3.2814
hfenergy: -679.6817651 hartree
pointgroup: C01 [X(C16H27N1)]
dipole: -0.0878404 0.0711724 0.3530983 debye
polarizability: 220.7510166|-0.5904064|176.96862|2.7086408|13.2600691|138.6404463 unknown
InChI: InChI=1S/C16H27N/c1-3-5-13-17(14-6-4-2)15-12-16-10-8-7-9-11-16/h7-11H,3-6,12-15H2,1-2H3
charge 0 multiplicity 1
44 atoms
N  -1.312736 0.148871 0.861442
C  -1.936144 -0.856745 1.765578
C  -1.853532 1.52036 1.070568
C  0.169857 0.106837 0.890164
C  -1.896768 -2.297701 1.207934
C  -3.236313 1.746552 0.418597
C  0.809604 0.569334 -0.449474
C  -2.718386 -2.479809 -0.087344
C  -3.206756 1.669861 -1.123852
C  2.326844 0.472371 -0.411239
C  -2.614856 -3.906268 -0.667567
C  -4.604764 1.832893 -1.757512
C  3.110757 1.524031 0.131499
C  2.992213 -0.69384 -0.871198
C  4.517395 1.41572 0.212917
C  4.398756 -0.808111 -0.79253
C  5.167253 0.24714 -0.248374
H  -2.995065 -0.570527 1.910497
H  -1.460797 -0.835739 2.779566
H  -1.140489 2.240653 0.625522
H  -1.909518 1.765643 2.162033
H  0.587958 0.721887 1.726705
H  0.490077 -0.933722 1.079498
H  -2.279495 -2.983795 1.99241
H  -0.847031 -2.602758 1.019141
H  -3.612535 2.741935 0.735328
H  -3.9635 1.004297 0.806398
H  0.499951 1.610984 -0.65949
H  0.391355 -0.061345 -1.255117
H  -2.369368 -1.736566 -0.829336
H  -3.781896 -2.239685 0.120129
H  -2.762598 0.699737 -1.416854
H  -2.528029 2.456959 -1.513486
H  -3.217787 -4.012831 -1.588286
H  -1.56664 -4.156236 -0.920174
H  -2.97192 -4.661515 0.058716
H  -4.556643 1.787665 -2.861259
H  -5.288956 1.032377 -1.416993
H  -5.060094 2.802644 -1.478942
H  2.614086 2.437159 0.484026
H  2.402229 -1.513752 -1.300314
H  5.106157 2.240438 0.631046
H  4.894803 -1.714584 -1.158391
H  6.258222 0.162081 -0.18908
