program: Gaussian 09
title: 000079812
version: EM64L-G09RevD.01
frameworkgroup: C1[X(C10H12O2)]
method: RPBEPBE
basis: SDD
operation: Freq
keyword: #pfreq=noraman
keyword: PBEPBE/SDD
title: #p freq=noraman PBEPBE/SDD
converged: NO YES NO NO
title: Mulliken charges:
elementType: O O C C C C C C C C C C H H H H H H H H H H H H
charge: -0.255971 -0.218081 -0.393255 -0.262582 0.357983 -0.676513 -0.338869 -0.361617 0.384971 -0.373420 -0.336463 -0.212329 0.221395 0.221560 0.208074 0.207837 0.210750 0.230843 0.211028 0.251748 0.257029 0.231998 0.273777 0.160106
chargesum: 0.00000
title: Mulliken charges with hydrogens summed into heavy atoms:
elementType: O O C C C C C C C C C C
charge: -0.255971 -0.218081 0.049700 0.153329 0.357983 -0.023892 -0.087121 -0.104587 0.384971 -0.141422 -0.062686 -0.052222
polarizability: 1.99117949e+02 -7.67338848e-01 1.08051544e+02 1.41272267e-01 5.47436661e-03 5.96347556e+01
1716.lowfreq: 0.0004 0.0005 0.0007 2.5124 4.5195 9.9616 39.5363 82.6887 87.8015
frequency: 39.1996 82.6584 87.7795 103.6365 155.7069 183.9090 196.8658 228.2564 263.9935 302.5655 331.0977 425.1721 447.6942 473.6457 513.5570 613.3583 637.6471 729.4445 762.3060 768.9160 815.5063 833.4994 850.0073 895.8003 903.3143 944.0591 971.2097 983.4692 998.4487 1001.4246 1053.0770 1113.5576 1137.3645 1138.8816 1170.5784 1221.3426 1229.7971 1237.1706 1287.5212 1297.0219 1310.4727 1359.6882 1377.0632 1399.0528 1403.7752 1432.6863 1471.2412 1478.1463 1482.8105 1488.5630 1498.1388 1563.6703 1609.2371 1622.5372 2858.6351 2954.9838 2981.0468 3006.9589 3015.6349 3055.5793 3083.4731 3086.8030 3119.9794 3148.1133 3165.0365 3171.2835
redmass: 5.1135 1.6989 4.2224 4.3097 3.0218 6.1937 2.8685 1.1824 4.1736 3.5228 3.6069 2.9183 6.3805 4.1819 2.5621 6.8073 7.0834 3.2602 5.4402 1.0883 1.3598 5.6970 1.4346 1.1442 1.7627 1.3772 6.0211 1.5139 2.6765 1.5373 2.7960 1.2960 2.1772 1.4298 1.2316 2.4395 1.2719 4.2966 1.1048 1.3093 1.3515 2.0745 1.4602 1.2712 1.9027 4.3613 1.1073 1.0811 1.0408 1.1639 2.1113 7.8451 6.1947 6.7664 1.0843 1.0551 1.0365 1.0602 1.1065 1.1018 1.1031 1.0988 1.0895 1.0884 1.0940 1.0970
irintensity: 0.4232 0.0022 0.3157 2.1049 8.8964 6.7399 2.3635 0.3554 2.0795 3.7337 8.1570 0.6931 2.5097 0.1588 19.7074 19.9161 24.8765 0.1773 1.3994 12.8899 25.6884 32.3304 49.3586 2.3541 7.4726 0.9247 117.3365 3.5240 1.6350 4.1075 6.3926 16.9117 6.0026 0.3054 158.1241 5.5365 0.3991 382.1144 0.0054 15.3936 1.1338 1.6685 10.6452 22.7557 2.8602 38.8878 22.6486 2.2255 14.0885 44.2646 34.4707 191.7297 375.5292 27.9683 135.3291 30.2529 37.0738 22.9637 22.8834 0.0959 81.3022 40.6667 11.1185 0.3627 13.9483 5.3647
temp: 298.150 k
press: 1.00000 atm
elementType: 8 8 6 6 6 6 6 6 6 6 6 6 1 1 1 1 1 1 1 1 1 1 1 1
symmnumber: 1
zpe: 511852.6 jmol-1
zpe.correction: 0.194954 hartree
zpe.thermalcorrener: 0.206836 hartree
zpe.thermalcorrenthalpy: 0.207780 hartree
zpe.thermalcorrgfe: 0.156320 hartree
zpe.sumelectzpe: -537.803182 hartree
zpe.sumelectthermal: -537.791300 hartree
zpe.sumelectthermalent: -537.790356 hartree
zpe.sumelectthermalfe: -537.841816 hartree
dipole: -5.8036 -2.3977 -0.0016
dipole: 6.2794
quadrupole: -87.1651 -65.1268 -73.4653
quadrupole: -2.9400 -0.0530 0.0006
quadrupole: -11.9127 10.1255 1.7871 -2.9400 -0.0530 0.0006
hfenergy: -537.9981363 hartree
pointgroup: C01 [X(C10H12O2)]
dipole: 2.2725257 0.9666518 0.0674827 debye
dipolederiv: -2.2758843 -0.0222719 -0.1043557 0.0913208 -0.3010973 0.0061456 -0.1105513 -0.0004832 -0.2792121 -1.3215357 -0.065274 -0.0462582 -0.5462874 -0.4803469 -0.0204576 -0.0198346 0.0041281 -0.3447717 -0.0227293 -0.0167631 -0.007383 -0.0829847 0.0762271 -0.0011211 -0.0030242 0.0024227 0.1353568 1.0580235 0.1292021 0.02781 0.5579908 0.2880295 0.035575 0.0080537 0.0123847 0.3907336 1.8307899 -0.1074645 0.0954838 -0.525681 0.2056543 -0.0325861 0.1161385 -0.0099006 0.1313588 -0.0696408 -0.0325526 -0.0073603 0.0559681 0.0394819 0.0071852 -0.0131249 0.0025526 0.1008784 -0.485259 0.0858118 -0.0198548 0.5886653 -0.1490056 0.0274093 -0.0462823 0.0008957 -0.2070252 -0.6562762 -0.033087 -0.0232887 -0.2863976 0.0637075 -0.0275553 -0.0104831 -0.0145744 -0.180236 -1.1466973 0.0767716 -0.0621767 0.3324469 -0.2563888 0.0301079 -0.0748739 0.0170028 -0.0162536 0.5196772 -0.0188115 0.0346786 0.1167742 0.1130675 -0.0076425 0.0272243 -0.0144226 -0.1353801 0.329554 0.0007511 0.0219515 -0.2762452 0.1263203 -0.0260745 0.0368819 -0.0118451 -0.0960518 1.9976612 -0.0429966 0.0987043 0.0260166 0.7316639 -0.0325823 0.0940436 -0.0361092 0.1054002 0.0544124 -0.0231688 0.0135643 0.0150148 0.0031262 0.102637 -0.0016565 0.1200839 -0.0756997 0.0556064 -0.0110282 0.0011482 0.0269541 -0.0253146 -0.1063302 0.0111093 -0.1277387 -0.046109 -0.0410767 0.0298088 0.0378511 -0.1036547 -0.0555566 -0.1004398 0.0109333 -0.109181 -0.0694204 -0.0370496 0.012409 -0.0336611 -0.1159613 -0.0337666 0.0846973 0.0060566 0.1077127 -0.0969814 0.0941013 0.0186511 0.0451851 -0.0377931 -0.0343929 -0.123347 0.0040611 -0.1367914 -0.0644949 -0.1800915 0.0763127 -0.0210793 0.1010483 0.0377498 0.0104526 -0.0226443 0.0090261 0.1059241 0.0966742 -0.0012346 -0.0262568 -0.0497556 -0.0009724 0.1095777 0.0218327 0.1289802 -0.1008472 -0.0086075 -0.095553 -0.0035722 -0.115528 0.0127297 0.0024216 -0.002594 0.0035551 0.1668826 0.0722878 0.0641196 -0.0082593 0.0572788 -0.0295801 0.0134136 -0.0082681 0.0138717 0.1669507 0.0602306 0.0797718 -0.0089933 0.0516279 -0.0706793 0.0146926 -0.0075498 0.016104 0.1513135 0.0537115 -0.0883855 -0.0004693 -0.0347646 0.0312617 0.0047008 -0.0031173 0.0018877 0.1535123 0.0221179 -0.0150184 -0.0034082 0.1539466 -0.2919184 0.0291199 -0.0123307 0.0204381 0.1041722 unknown
polarizability: 198.7542373|0.3493082|107.9076511|7.169113|-2.565899|60.1423607 unknown
InChI: InChI=1S/C10H12O2/c1-2-7-12-10-5-3-9(8-11)4-6-10/h3-6,8H,2,7H2,1H3
charge 0 multiplicity 1
24 atoms
O  1.725181 -0.72041 0.166768
O  -4.745587 -0.267625 -0.186941
C  4.120806 -0.396857 0.290673
C  2.7765 0.322878 0.171843
C  0.393531 -0.32115 0.076057
C  5.299677 0.600895 0.29067
C  -0.035237 1.030191 -0.018924
C  -0.558632 -1.380289 0.083026
C  -2.372457 0.260976 -0.095957
C  -1.414109 1.306442 -0.103496
C  -1.924723 -1.089829 -0.001822
C  -3.811306 0.582205 -0.185754
H  4.12525 -0.995581 1.220251
H  4.220462 -1.108036 -0.550123
H  2.611367 1.00616 1.030335
H  2.718128 0.907187 -0.76949
H  5.230369 1.309833 1.137005
H  6.261015 0.065853 0.380631
H  5.330458 1.190931 -0.644473
H  0.684841 1.852918 -0.027481
H  -0.191126 -2.40826 0.156206
H  -1.753848 2.347578 -0.176784
H  -2.675079 -1.887746 0.002229
H  -4.040079 1.677435 -0.255649
