program: Gaussian 09
title: 000079809
version: EM64L-G09RevD.01
frameworkgroup: C1[X(C7H11N)]
method: RPBEPBE
basis: SDD
operation: Freq
keyword: #pfreq=noraman
keyword: PBEPBE/SDD
title: #p freq=noraman PBEPBE/SDD
converged: NO YES NO NO
title: Mulliken charges:
elementType: N C C C C C C C H H H H H H H H H H H
charge: -0.022924 -0.017079 -0.462320 -0.471678 -0.423641 -0.425417 -0.478317 -0.153487 0.231016 0.192584 0.245114 0.229714 0.195601 0.210819 0.220559 0.223100 0.208819 0.243968 0.253568
chargesum: 0.00000
title: Mulliken charges with hydrogens summed into heavy atoms:
elementType: N C C C C C C C
charge: -0.022924 0.213937 -0.024622 -0.046362 0.007737 0.006502 0.019220 -0.153487
polarizability: 9.17872531e+01 -6.35459882e+00 7.18409103e+01 1.71405577e+00 -1.47596163e+00 5.97424938e+01
1716.lowfreq: -22.2345 -13.1446 -0.0005 0.0004 0.0007 6.7390 19.0159 72.7004 107.6197
frequency: 6.0351 72.6585 107.5812 176.9587 289.3324 372.6856 398.9151 443.8536 594.9619 617.5811 758.3625 806.9443 838.2420 879.4315 898.6133 919.9838 962.4635 976.5323 984.2481 1049.5526 1084.8605 1106.8761 1151.0580 1174.6681 1192.6797 1220.2311 1240.6101 1263.2838 1284.5705 1295.4699 1300.6448 1304.7893 1323.0735 1345.1573 1441.3761 1463.0732 1473.1970 1474.4737 1492.0811 2192.8112 2973.7947 2975.7551 2981.0751 2992.3147 2998.4957 3014.4367 3039.4154 3044.2936 3057.4319 3064.1479 3082.5677
redmass: 1.6044 3.6084 4.2989 2.3937 3.8573 3.3040 2.5223 3.2750 3.1817 2.6986 1.2657 1.5822 2.1552 2.3369 2.2523 4.2078 1.5182 1.6698 1.4938 3.2995 2.1929 2.9182 1.2614 1.4793 1.2843 1.2302 1.3313 1.2289 1.2866 1.2095 1.2942 1.3175 1.5063 1.5555 1.0861 1.0822 1.0837 1.0851 1.0992 12.4327 1.0708 1.0666 1.0604 1.0723 1.0610 1.0653 1.1002 1.0986 1.1015 1.1006 1.1046
irintensity: 0.3391 4.3605 3.7062 1.4401 0.4602 0.3672 0.6223 1.0562 5.1217 0.7838 4.7892 1.4552 2.8365 1.6086 2.8799 2.6558 6.2631 0.2084 1.6399 0.8274 0.0862 0.2442 1.5253 1.1231 2.0365 1.9260 0.1733 1.2167 1.1607 2.4135 1.2632 1.7241 1.4456 4.5235 10.7497 2.9692 9.3111 13.5753 2.9918 14.3040 20.7258 11.4791 8.2610 56.1869 31.4437 49.3858 5.8587 34.8610 11.9320 9.4826 102.9972
temp: 298.150 k
press: 1.00000 atm
elementType: 7 6 6 6 6 6 6 6 1 1 1 1 1 1 1 1 1 1 1
symmnumber: 1
zpe: 431873.7 jmol-1
zpe.correction: 0.164492 hartree
zpe.thermalcorrener: 0.172818 hartree
zpe.thermalcorrenthalpy: 0.173763 hartree
zpe.thermalcorrgfe: 0.128876 hartree
zpe.sumelectzpe: -327.455825 hartree
zpe.sumelectthermal: -327.447498 hartree
zpe.sumelectthermalent: -327.446554 hartree
zpe.sumelectthermalfe: -327.491441 hartree
dipole: 3.7568 -2.0089 0.6716
dipole: 4.3128
quadrupole: -65.0927 -48.5876 -47.5904
quadrupole: 5.9489 -2.1266 0.1774
quadrupole: -11.3358 5.1693 6.1665 5.9489 -2.1266 0.1774
hfenergy: -327.6203166 hartree
pointgroup: C01 [X(C7H11N1)]
dipole: 1.5029416 0.7429592 -0.2613584 debye
dipolederiv: -0.3562387 0.0030596 0.0009664 -0.0886461 -0.2361747 -0.0016685 0.0472691 -0.0026201 -0.2412241 0.1749774 -0.0187672 0.0257938 -0.0997851 0.0412554 0.0033807 0.0411712 0.0437516 0.1439303 -0.0376463 0.0284838 -0.0365307 0.0009136 -0.0089712 -0.0640834 0.0012179 -0.0134113 0.1437177 -0.043105 0.0025093 0.0073135 0.0689976 0.034505 0.044374 -0.0124253 -0.0356864 0.1687338 0.017913 -0.0137835 -0.0342576 -0.0060017 0.0495033 -0.0088781 -0.0216767 -0.0455972 0.1398544 0.0275976 0.0102853 -0.0254514 -0.0058673 0.0071215 -0.000714 0.0136242 0.0244059 0.1487563 -0.0498435 -0.0529334 0.0136354 -0.0374508 0.1194364 0.0418765 -0.0047612 0.0285691 0.2244169 0.1416767 0.1036328 -0.055052 0.2030908 0.0068063 -0.0256741 -0.1093084 -0.0187061 -0.051598 0.0332897 0.0006121 0.0100937 0.0053136 0.0318876 0.0242156 0.0176416 0.0084055 -0.1568542 0.0376942 0.017112 -0.0335786 0.0240787 0.058137 0.0535537 -0.0570926 -0.0100582 -0.1733025 -0.020158 -0.1101963 0.0247778 -0.1072635 -0.0612956 0.0288493 0.0404223 0.0511465 0.0607187 0.0561722 0.0023848 0.0004945 -0.0111941 -0.1441989 -0.0938038 -0.0079892 -0.1247285 0.0160615 0.035619 0.0242405 -0.0390989 0.0103399 0.0465766 0.0415259 -0.0157476 0.1060988 -0.1625142 -0.0294357 0.0843771 0.0725329 0.0653217 -0.0212528 -0.0779481 0.0983689 -0.1160037 -0.035063 0.0428216 -0.0037397 -0.0193891 0.0199941 -0.0272865 0.0874647 -0.0600312 0.137201 -0.0940889 0.0217163 -0.0054817 -0.0628813 -0.0114007 0.0330525 -0.0223427 -0.1320662 -0.0375246 -0.1375061 -0.1322079 -0.0505938 0.0897655 -0.0285648 0.0425461 0.0234542 0.1368213 0.0357743 0.0009038 0.0504217 -0.0371927 0.0404262 -0.0342058 0.096375 -0.0107228 -0.0020697 0.0376895 -0.0795398 0.0287356 0.0159911 0.02044 0.0323297 -0.068023 -0.042859 0.0266317 -0.0687061 0.0845975 unknown
polarizability: 92.1772333|5.7143516|71.4556816|-1.6818494|-1.4242628|59.7377423 unknown
InChI: InChI=1S/C7H11N/c8-6-5-7-3-1-2-4-7/h7H,1-5H2
charge 0 multiplicity 1
19 atoms
N  -3.318862 -0.513927 0.258204
C  0.150204 0.328881 0.264098
C  0.529019 -1.044864 -0.345216
C  1.401889 1.19193 -0.038553
C  2.034664 -1.220127 0.009121
C  2.59962 0.230393 0.213945
C  -1.156804 0.946131 -0.300813
C  -2.35562 0.144115 0.003372
H  0.042954 0.219589 1.362546
H  0.394693 -1.000218 -1.445048
H  -0.102012 -1.868789 0.031087
H  1.452622 2.108927 0.576156
H  1.377317 1.504318 -1.102429
H  2.574546 -1.765723 -0.784861
H  2.145715 -1.809797 0.937189
H  2.977857 0.352861 1.245279
H  3.44266 0.447067 -0.465789
H  -1.071157 1.048684 -1.401141
H  -1.306403 1.96425 0.108853
