program: Gaussian 09
title: 000079808
version: EM64L-G09RevD.01
frameworkgroup: C1[X(C10H23NO4)]
method: RPBEPBE
basis: SDD
operation: Freq
keyword: #p
keyword: freq=noraman
keyword: PBEPBE/SDD
title: #p freq=noraman PBEPBE/SDD
converged: YES YES NO NO
title: Mulliken charges:
elementType: O O O O N C C C C C C C C C C H H H H H H H H H H H H H H H H H H H H H H H
charge: -0.286470 -0.286458 -0.282582 -0.282582 -0.308671 -0.376482 -0.376452 -0.251867 -0.251916 -0.252298 -0.252301 -0.274545 -0.274543 -0.493160 -0.493160 0.202008 0.223416 0.201977 0.223432 0.240495 0.173689 0.208187 0.208192 0.173673 0.199930 0.203176 0.203154 0.199955 0.201228 0.202068 0.202048 0.201251 0.233277 0.202416 0.202110 0.233277 0.202117 0.202411
chargesum: 0.00000
title: Mulliken charges with hydrogens summed into heavy atoms:
elementType: O O O O N C C C C C C C C C C
charge: -0.286470 -0.286458 -0.282582 -0.282582 -0.068176 0.048942 0.048957 0.130009 0.129949 0.150808 0.150808 0.128751 0.128756 0.144643 0.144645
polarizability: 1.93617717e+02 3.39272878e-04 1.10890128e+02 4.10001960e-04 2.82113717e-01 1.03483821e+02
1716.lowfreq: -10.3852 -3.2375 -2.0794 -0.0015 -0.0013 0.0018 11.9299 24.9287 29.3756
frequency: 11.0941 24.6173 29.3010 37.9823 55.8815 59.9260 64.1719 83.6989 95.4521 98.1008 114.8060 117.9333 121.5854 137.8409 158.2488 166.7156 194.0704 228.1500 228.1795 270.0844 300.1086 349.2807 405.6310 440.5809 475.3544 514.5265 525.2505 700.5775 815.5641 827.2085 835.0094 838.1359 878.3794 883.0132 938.5871 951.1170 1025.6560 1029.0356 1047.8513 1055.6404 1072.6447 1079.5409 1086.8746 1096.7191 1099.3722 1101.0025 1108.4974 1118.4057 1123.3168 1123.7318 1145.7575 1153.6080 1162.2307 1164.8136 1165.4372 1172.3640 1175.9886 1223.9320 1254.0899 1254.2635 1261.5400 1269.2236 1291.3787 1311.2300 1326.9246 1345.9117 1372.3499 1389.2002 1411.9826 1418.7450 1439.8138 1439.9447 1458.2464 1458.2564 1459.5960 1470.5821 1470.6107 1475.0113 1476.3489 1486.1889 1489.1739 1491.8002 1495.3598 1496.3238 1499.2253 2894.9401 2900.6545 2907.8182 2908.5662 2923.3332 2923.3922 2939.7572 2939.8583 2944.8098 2945.0140 2981.0156 2981.1353 2983.1669 2984.0860 2997.5085 2997.5301 3012.5977 3012.6965 3039.0605 3040.9865 3102.5061 3102.5216 3422.0553
redmass: 4.5449 4.1468 2.8456 2.3683 2.3580 2.6164 4.3841 2.7002 2.1633 2.9737 3.0410 2.1723 3.1257 3.0766 6.2092 2.6893 3.7440 1.1896 1.1906 3.8286 5.0292 3.7581 3.4776 5.1977 3.1376 3.0467 5.0141 1.2668 1.1013 1.1138 1.0982 1.1170 6.4379 6.2458 5.2999 5.6372 3.0068 4.3624 5.0851 1.8032 4.6443 7.9258 3.4011 2.8610 1.4560 1.3366 2.8427 1.8976 1.6186 1.3531 1.4846 3.6382 1.1296 1.5508 1.5621 1.1888 1.1816 1.4318 1.1474 1.1492 1.1383 1.1139 1.1864 1.2081 1.2704 1.3108 1.3787 1.4320 1.4739 1.5065 1.1777 1.1825 1.0512 1.0512 1.2218 1.0642 1.0642 1.0742 1.0804 1.0810 1.0722 1.0851 1.0796 1.0808 1.0798 1.0706 1.0705 1.0614 1.0617 1.0357 1.0357 1.0551 1.0551 1.0536 1.0537 1.1032 1.1039 1.0977 1.0970 1.1027 1.1027 1.1102 1.1102 1.0932 1.0912 1.0972 1.0972 1.0736
irintensity: 0.0939 0.1863 0.0117 0.0962 1.8854 9.9564 0.7905 0.0608 2.7637 4.0785 1.1475 0.1293 22.6337 1.6566 0.1079 8.2005 15.4162 3.4405 6.9525 1.7961 0.8542 0.4859 0.1353 0.3890 0.5006 17.5143 1.7038 105.1761 1.6707 0.1160 0.3125 3.0567 60.5806 0.1059 1.4698 0.1060 0.2424 4.3511 0.2715 38.7008 424.6956 3.7315 153.6851 0.2704 0.4437 0.1606 54.5422 0.1021 0.1891 0.0087 0.5625 86.0511 4.9342 15.0659 0.5377 17.7490 2.2137 5.9573 0.0325 0.0782 0.8305 1.6935 14.2885 0.2571 11.1224 0.1287 0.3573 0.1586 1.9710 0.7725 0.0657 0.2771 9.2355 15.3508 39.1636 23.4401 1.5040 5.6456 0.1439 8.5039 0.4713 8.2588 4.5845 0.4370 7.8865 43.0452 122.1979 26.2709 100.1978 114.0268 35.9324 3.8807 20.2464 21.2636 218.3699 0.1291 3.1237 2.7393 109.3701 3.0451 162.3905 2.9365 213.5154 0.1903 89.7695 35.0494 32.4216 2.1096
temp: 298.150 k
press: 1.00000 atm
elementType: 8 8 8 8 7 6 6 6 6 6 6 6 6 6 6 1 1 1 1 1 1 1 1 1 1 1 1 1 1 1 1 1 1 1 1 1 1 1
symmnumber: 1
zpe: 863745.2 jmol-1
zpe.correction: 0.328983 hartree
zpe.thermalcorrener: 0.349485 hartree
zpe.thermalcorrenthalpy: 0.350429 hartree
zpe.thermalcorrgfe: 0.274640 hartree
zpe.sumelectzpe: -749.128577 hartree
zpe.sumelectthermal: -749.108075 hartree
zpe.sumelectthermalent: -749.107131 hartree
zpe.sumelectthermalfe: -749.182920 hartree
dipole: -0.0005 -0.8442 0.9113
dipole: 1.2422
quadrupole: -75.9890 -93.7211 -91.9327
quadrupole: 0.0034 0.0217 2.7804
quadrupole: 11.2252 -6.5069 -4.7184 0.0034 0.0217 2.7804
hfenergy: -749.45756 hartree
pointgroup: C01 [X(C10H23N1O4)]
dipole: -0.0006711 -0.3591342 0.3314829 debye
polarizability: 193.6175374|-0.0035398|110.8009719|0.1271508|0.8555392|103.5731567 unknown
InChI: InChI=1S/C10H23NO4/c1-12-7-9-14-5-3-11-4-6-15-10-8-13-2/h11H,3-10H2,1-2H3
charge 0 multiplicity 1
38 atoms
O  3.657129 -0.277449 0.104927
O  -3.656406 -0.277176 0.094355
O  7.264655 0.331138 -0.177335
O  -7.263199 0.331671 -0.196581
N  0.000078 0.39812 0.307812
C  1.247618 -0.390165 0.208326
C  -1.247216 -0.390037 0.20426
C  2.45089 0.554912 0.113549
C  -2.450196 0.555149 0.106953
C  4.880605 0.5173 -0.038887
C  -4.879485 0.517683 -0.052207
C  6.046179 -0.469849 -0.029293
C  -6.045027 -0.469534 -0.047233
C  8.468305 -0.495161 -0.188828
C  -8.46674 -0.494707 -0.212895
H  1.40962 -1.092288 1.060947
H  1.201628 -1.003175 -0.710516
H  -1.411588 -1.092842 1.05587
H  -1.198738 -1.002287 -0.714963
H  -0.001275 0.990035 1.151231
H  2.474981 1.24995 0.985671
H  2.384033 1.165854 -0.811611
H  -2.380802 1.166836 -0.817532
H  -2.476655 1.249488 0.979572
H  4.984671 1.238966 0.799768
H  4.871071 1.087748 -0.992141
H  -4.86705 1.089295 -1.00473
H  -4.986165 1.238318 0.78701
H  6.059016 -1.038776 0.92545
H  5.942064 -1.192615 -0.867226
H  -5.938997 -1.19074 -0.886271
H  -6.059995 -1.040237 0.90642
H  9.318011 0.195706 -0.306182
H  8.460184 -1.215869 -1.034749
H  8.583238 -1.062253 0.760051
H  -9.316202 0.196326 -0.331029
H  -8.584082 -1.063762 0.734512
H  -8.456359 -1.213671 -1.060275
