program: Gaussian 09
title: 000079816
version: EM64L-G09RevD.01
frameworkgroup: C1[X(C13H18O2)]
method: RPBEPBE
basis: SDD
operation: Freq
keyword: #pfreq=noraman
keyword: PBEPBE/SDD
title: #p freq=noraman PBEPBE/SDD
converged: YES YES NO NO
title: Mulliken charges:
elementType: O O C C C C C C C C C C C C C H H H H H H H H H H H H H H H H H H
charge: -0.254131 -0.220825 -0.361411 -0.347928 -0.403206 -0.355155 -0.320535 -0.693192 0.365097 -0.367700 -0.331106 -0.346889 -0.363010 0.381044 -0.209643 0.188965 0.189738 0.191267 0.191194 0.216840 0.216355 0.195335 0.195580 0.213682 0.213068 0.217795 0.210764 0.210690 0.256429 0.254866 0.235556 0.269717 0.160747
chargesum: 0.00000
title: Mulliken charges with hydrogens summed into heavy atoms:
elementType: O O C C C C C C C C C C C C C
charge: -0.254131 -0.220825 0.017292 0.034534 0.029989 0.035760 0.106215 -0.053943 0.365097 -0.111271 -0.076240 -0.111333 -0.093293 0.381044 -0.048896
polarizability: 2.46878257e+02 -9.64135967e+00 1.39084286e+02 -5.14253768e-01 -1.20306605e-01 8.54322755e+01
1716.lowfreq: -15.5294 -4.9687 -0.0006 0.0005 0.0010 2.3181 22.2085 35.8157 41.2028
frequency: 21.4643 35.4115 41.0606 61.8045 104.3501 111.3114 117.1190 135.7701 152.0018 191.7967 197.6255 202.2282 231.6573 271.2448 328.2487 372.7102 403.8740 422.0271 465.2059 512.5626 513.4267 607.1204 628.6492 724.3511 727.5398 749.0807 771.1890 805.1924 828.8495 832.3459 835.7707 890.1518 890.5309 953.5935 957.8628 979.5447 989.4615 997.9411 998.1285 1012.3938 1048.4299 1071.8769 1085.2424 1114.3824 1127.3565 1145.9218 1166.7325 1195.6513 1221.3313 1236.8053 1239.8625 1246.9350 1281.2899 1291.3145 1294.7814 1297.0304 1300.1650 1342.8255 1357.3657 1358.5781 1378.9809 1390.4087 1399.8511 1431.4348 1463.3580 1465.4100 1469.5923 1475.9333 1477.5994 1483.8501 1488.7478 1497.9659 1566.5083 1600.8572 1626.4783 2861.9427 2952.9508 2956.2388 2959.7380 2969.6768 2973.1768 2991.7545 2995.7188 3007.7426 3015.1182 3033.3089 3064.4827 3070.0664 3073.2236 3123.4984 3143.9336 3166.0707 3169.9087
redmass: 3.4358 2.1363 3.4463 3.8196 3.4093 1.9713 4.3913 3.0755 2.0320 5.1139 5.0847 3.2801 1.1127 3.5449 3.6349 5.3291 3.2477 2.9388 4.0033 2.5569 4.0581 7.3114 6.9919 1.0676 3.3332 1.1004 5.5055 1.1664 1.2441 5.6483 1.5696 1.1919 1.8802 1.3928 7.8474 1.3786 1.1482 2.5576 1.7057 3.8107 3.0931 2.6737 2.1014 1.3289 2.7163 1.4272 1.2334 1.5367 2.3339 3.0759 1.4250 1.2984 1.0807 1.1269 1.0936 1.3121 1.3550 1.4268 1.6638 2.1640 1.4427 1.2158 1.9659 4.3210 1.0761 1.0748 1.0951 1.0958 1.0423 1.1161 1.1168 2.1844 8.1427 5.9196 6.8171 1.0844 1.0569 1.0573 1.0587 1.0591 1.0364 1.0981 1.0591 1.1016 1.1065 1.1048 1.1052 1.1010 1.0993 1.0896 1.0883 1.0954 1.0955
irintensity: 0.2922 0.2363 0.4704 0.0011 4.3966 0.0426 2.2061 5.2089 4.2638 4.6943 1.3576 1.7656 0.0031 0.8436 7.2602 0.1219 0.1267 1.1746 0.7927 19.7597 6.9880 47.7586 5.7720 12.3176 0.0716 0.6552 2.6527 8.6174 0.0353 30.9882 72.1466 1.6189 7.3363 2.1123 90.5823 0.0335 0.0414 1.5278 6.7332 2.7082 19.2288 13.5560 6.9181 12.5987 10.5585 1.3503 171.1558 0.0079 3.3481 329.2653 93.7758 0.0108 0.0021 0.0281 1.0467 0.8279 15.0617 0.5613 2.2830 16.0605 15.7804 11.8391 63.7135 1.2946 0.5735 0.3328 17.1001 5.7111 12.8217 25.9661 31.3548 37.4605 60.8536 491.3003 42.6757 144.9437 5.1071 15.0172 15.1983 92.7662 37.1271 1.2016 37.7625 2.7715 18.0474 35.3938 47.0275 121.3977 51.9605 11.3928 1.5247 13.1403 5.4750
temp: 298.150 k
press: 1.00000 atm
elementType: 8 8 6 6 6 6 6 6 6 6 6 6 6 6 6 1 1 1 1 1 1 1 1 1 1 1 1 1 1 1 1 1 1
symmnumber: 1
zpe: 731169.5 jmol-1
zpe.correction: 0.278488 hartree
zpe.thermalcorrener: 0.294633 hartree
zpe.thermalcorrenthalpy: 0.295578 hartree
zpe.thermalcorrgfe: 0.232571 hartree
zpe.sumelectzpe: -655.472346 hartree
zpe.sumelectthermal: -655.456201 hartree
zpe.sumelectthermalent: -655.455257 hartree
zpe.sumelectthermalfe: -655.518263 hartree
dipole: -5.1768 1.2809 0.0274
dipole: 5.3330
quadrupole: -115.0384 -90.1608 -92.5787
quadrupole: 18.0191 0.0315 -0.0775
quadrupole: -15.7791 9.0985 6.6806 18.0191 0.0315 -0.0775
hfenergy: -655.7508342 hartree
pointgroup: C01 [X(C13H18O2)]
dipole: -2.037847 -0.4603917 -0.1937741 debye
polarizability: 246.8374957|7.6657686|134.873036|6.7065072|14.2866484|89.6842867 unknown
InChI: InChI=1S/C13H18O2/c1-2-3-4-5-10-15-13-8-6-12(11-14)7-9-13/h6-9,11H,2-5,10H2,1H3
charge 0 multiplicity 1
33 atoms
O  -0.115135 -0.862077 -0.291093
O  5.996151 1.301707 0.513604
C  -3.667022 0.509858 0.011172
C  -5.055633 -0.141563 -0.179085
C  -2.505908 -0.482007 -0.233435
C  -6.225614 0.840718 0.057152
C  -1.140469 0.174282 -0.026414
C  -7.608838 0.180624 -0.129949
C  1.228102 -0.518377 -0.155134
C  2.152678 -1.563237 -0.425009
C  1.693079 0.773059 0.224965
C  3.528811 -1.317464 -0.312543
C  3.075033 1.003508 0.333911
C  4.009977 -0.032708 0.068707
C  5.463548 0.204993 0.182871
H  -3.596548 0.921649 1.039746
H  -3.572598 1.373817 -0.679439
H  -5.129056 -0.557623 -1.205344
H  -5.15516 -1.002735 0.513848
H  -2.56048 -0.881102 -1.264253
H  -2.596264 -1.346379 0.451846
H  -6.149463 1.2588 1.081699
H  -6.126719 1.699496 -0.637728
H  -0.992459 1.02151 -0.727126
H  -1.028379 0.543946 1.013553
H  -8.428662 0.900816 0.046266
H  -7.722994 -0.216984 -1.15605
H  -7.743118 -0.663111 0.572954
H  1.763283 -2.543171 -0.715994
H  0.990773 1.585408 0.431894
H  4.24477 -2.122651 -0.520367
H  3.460063 1.987124 0.625326
H  6.10025 -0.687127 -0.05215
