program: Gaussian 09
title: 000079802
version: EM64L-G09RevD.01
frameworkgroup: C1[X(C9H9N)]
method: RPBEPBE
basis: SDD
operation: Freq
keyword: #p
keyword: freq=noraman
keyword: PBEPBE/SDD
title: #p freq=noraman PBEPBE/SDD
converged: YES YES NO NO
title: Mulliken charges:
elementType: N C C C C C C C C C H H H H H H H H H
charge: -0.027864 0.147385 0.357429 0.264817 -0.417224 -0.790113 -0.803206 -0.382723 -0.219233 -0.282766 0.237707 0.232411 0.261233 0.232859 0.231222 0.231018 0.231084 0.259013 0.236951
chargesum: 0.00000
title: Mulliken charges with hydrogens summed into heavy atoms:
elementType: N C C C C C C C C C
charge: -0.027864 0.147385 0.357429 0.264817 -0.179518 -0.063610 -0.109882 -0.123710 0.017718 -0.282766
polarizability: 1.37729560e+02 -4.75202395e+00 1.11122997e+02 6.90280315e-03 -6.01271347e-03 4.95821733e+01
1716.lowfreq: -11.4295 -8.4115 -0.0008 -0.0007 -0.0007 9.2297 71.6593 103.3325 146.8099
frequency: 70.8914 103.3215 146.8099 157.8919 192.3204 250.7708 307.1237 383.8223 407.7423 442.5696 508.2750 512.4844 562.1521 598.0502 643.7383 729.3752 802.7968 805.9337 871.6729 920.5889 986.0087 990.5866 1026.5528 1053.6113 1060.1970 1091.0891 1178.4137 1200.9977 1240.6133 1266.6642 1367.6542 1396.4962 1408.7871 1432.1859 1451.0149 1461.5342 1474.7492 1477.0982 1481.7141 1591.9116 1597.2634 2171.3142 2974.9152 2977.3056 3046.6697 3051.3614 3089.3026 3098.5136 3128.7207 3149.1362 3170.3274
redmass: 1.0293 3.9846 7.0965 1.1194 3.2074 2.7378 2.5445 3.4568 5.1768 6.5271 2.9884 5.3752 5.1368 4.7318 5.7443 2.2154 1.5231 4.8694 2.7314 1.3496 1.3534 1.4350 1.4467 1.6548 2.0043 1.9286 1.2226 3.9004 2.2834 2.0030 6.8347 1.2412 1.2227 1.8146 2.9520 1.0469 1.3014 1.0456 1.1419 6.4028 5.8145 12.6378 1.0377 1.0389 1.0967 1.0967 1.0983 1.0977 1.0881 1.0910 1.0996
irintensity: 0.0299 1.5112 3.6498 2.4516 0.0543 4.1385 0.1392 1.2087 5.3900 0.1794 0.0435 1.6880 0.1931 0.1543 0.5872 14.9534 52.3632 0.1537 0.5655 1.4110 0.0310 8.2482 9.7034 1.3850 9.8660 7.3103 0.4134 0.5093 6.1215 0.3419 0.4544 5.9234 28.8991 2.6101 13.5847 0.0152 21.4312 34.7219 11.2736 1.4138 5.1142 37.4596 39.3749 6.8890 34.9104 0.3140 21.7178 6.7198 8.3124 11.1376 14.7992
temp: 298.150 k
press: 1.00000 atm
elementType: 7 6 6 6 6 6 6 6 6 6 1 1 1 1 1 1 1 1 1
symmnumber: 1
zpe: 397824.4 jmol-1
zpe.correction: 0.151523 hartree
zpe.thermalcorrener: 0.161123 hartree
zpe.thermalcorrenthalpy: 0.162067 hartree
zpe.thermalcorrgfe: 0.116763 hartree
zpe.sumelectzpe: -402.395870 hartree
zpe.sumelectthermal: -402.386271 hartree
zpe.sumelectthermalent: -402.385327 hartree
zpe.sumelectthermalfe: -402.430631 hartree
dipole: -4.8290 0.3285 0.0015
dipole: 4.8402
quadrupole: -70.5462 -50.9403 -61.5347
quadrupole: 3.5155 0.0076 -0.0020
quadrupole: -9.5392 10.0668 -0.5276 3.5155 0.0076 -0.0020
hfenergy: -402.5473937 hartree
pointgroup: C01 [X(C9H9N1)]
dipole: 1.9037337 -0.0019825 -0.0451125 debye
dipolederiv: -0.4925408 -0.0226191 0.0054634 -0.0483097 -0.24794 0.0011007 0.0057637 0.0005665 -0.2528776 -0.0276895 0.2298695 -0.0008722 -0.011817 0.2960561 -0.0000134 -0.0003203 -0.0049737 -0.0504644 0.1430814 -0.3585099 -0.003509 -0.2788582 0.0156067 0.0062837 -0.0030353 0.0076761 -0.0352298 -0.0989793 -0.0383054 0.0047798 -0.1350215 0.052818 0.0032569 0.0046144 0.0009452 0.0980371 0.0592013 0.0245836 -0.0049797 0.0819261 -0.0078859 -0.0020433 -0.0052886 -0.0007656 -0.1592856 0.0211297 0.0156981 0.0008811 -0.0381228 -0.1956862 0.0012109 0.0007775 -0.0012257 0.0606826 -0.0027017 0.0836913 0.0010729 0.1424301 -0.0785206 -0.0030607 0.0001515 -0.001243 0.0584501 0.0227738 -0.0872177 -0.0039355 0.102778 -0.0180521 -0.0026031 -0.0041742 0.0017325 -0.1511016 -0.1283503 0.1148339 -0.0006226 0.0663499 0.0777215 -0.0020268 -0.0006263 -0.0030456 -0.1480125 0.4695803 0.0722562 -0.0106156 0.1335075 -0.0135456 -0.0030623 -0.010707 -0.0016309 0.0166365 -0.1147981 -0.0536923 0.0062446 -0.0259981 0.0792891 0.0006892 0.0063279 0.0013464 0.1497692 0.0679008 0.0374412 -0.09822 0.0189434 0.0004469 0.0569967 -0.068765 0.1036093 -0.0282836 -0.0832343 -0.0701968 0.0059341 0.0151187 0.0957455 -0.0005022 0.0055541 0.0020453 0.1147096 0.0771555 0.0312855 0.0919194 0.0154806 -0.0000558 -0.058094 0.062788 -0.1051585 -0.0370254 0.0650556 0.0111637 0.0480672 0.0489447 -0.0060098 0.1021663 -0.0138682 0.1243697 -0.0408932 0.06324 0.0043257 -0.053545 0.0435049 -0.0078064 -0.1047121 0.0084982 -0.1251596 -0.0370002 -0.1133337 -0.0326519 0.0060249 -0.1446074 0.0410547 0.0039971 0.0063462 0.0010453 0.1124372 0.011489 0.0886909 0.0034435 0.0677133 0.0156897 -0.0013009 0.0034836 -0.0018021 0.1665853 0.0610204 -0.0506465 0.0024686 -0.0539623 -0.0989258 0.001717 0.0024798 0.0016686 0.1628663 unknown
polarizability: 138.2081951|2.8745924|110.5957961|-2.0710197|-0.1694057|49.6307395 unknown
InChI: InChI=1S/C9H9N/c1-7-4-3-5-9(6-10)8(7)2/h3-5H,1-2H3
charge 0 multiplicity 1
19 atoms
N  -3.401601 -0.263263 0.093883
C  0.155306 -0.721374 0.01037
C  1.5338 -0.351266 -0.022267
C  -0.828235 0.315614 0.03139
C  1.887727 1.020161 -0.032703
C  -0.246865 -2.183208 0.02229
C  2.615956 -1.414966 -0.045304
C  -0.455418 1.689302 0.020385
C  0.90602 2.037248 -0.011717
C  -2.232287 -0.01011 0.065152
H  2.948981 1.294132 -0.057825
H  0.18127 -2.707584 0.897799
H  -1.340901 -2.308974 0.054123
H  0.12969 -2.707903 -0.876413
H  2.56509 -2.067944 0.846916
H  2.51952 -2.076172 -0.927581
H  3.620106 -0.959781 -0.073283
H  -1.233764 2.458292 0.037086
H  1.204305 3.090596 -0.020501
