program: Gaussian 09
title: 000079791
version: EM64L-G09RevD.01
frameworkgroup: C1[X(C9H7NO2)]
method: RPBEPBE
basis: SDD
operation: Freq
keyword: #pfreq=noraman
keyword: PBEPBE/SDD
title: #p freq=noraman PBEPBE/SDD
converged: YES YES NO NO
title: Mulliken charges:
elementType: O O N C C C C C C C C C H H H H H H H
charge: -0.273255 -0.214966 -0.020471 0.253080 0.218044 -0.313646 -0.340215 -0.206423 -0.231929 0.262358 -0.741211 -0.213120 0.308726 0.262697 0.239343 0.241484 0.261219 0.247267 0.261017
chargesum: 0.00000
title: Mulliken charges with hydrogens summed into heavy atoms:
elementType: O O N C C C C C C C C C
charge: -0.273255 -0.214966 -0.020471 0.253080 0.218044 -0.004919 -0.077518 0.032920 0.009555 0.262358 0.028292 -0.213120
polarizability: 1.37629013e+02 7.80573169e+00 1.39121670e+02 1.64923333e-02 9.79005054e-03 4.74765509e+01
1716.lowfreq: -0.0007 -0.0004 0.0005 6.2883 9.4916 11.0280 27.7373 63.0145 85.7101
frequency: 27.7030 62.9894 85.7099 105.5962 132.5307 184.3305 251.2249 308.6412 314.4617 388.5753 461.6325 493.2600 515.3203 550.2004 573.8067 576.2077 648.4509 722.9355 747.2841 765.8223 778.0847 889.2405 894.1999 969.6132 991.0907 1001.2952 1039.5057 1040.6847 1093.3829 1160.9104 1175.6298 1187.3143 1212.1333 1277.1045 1372.9063 1387.0642 1431.6598 1450.3982 1450.4842 1472.4801 1582.5019 1597.8676 1670.3341 2183.8940 3011.0493 3098.2958 3145.0005 3147.7226 3158.2940 3176.7034 3213.0506
redmass: 4.5674 1.6687 1.8721 7.6619 5.7521 5.8908 5.9039 5.8536 5.1169 4.2561 6.6301 3.8136 5.9623 3.1647 4.3201 7.4771 6.0568 6.6343 4.2243 6.3484 1.2764 7.3867 1.3745 1.3709 2.0529 1.3247 2.1732 1.6429 2.7360 2.5448 1.6111 1.6051 2.9218 1.4778 10.4339 1.2370 2.2386 1.0658 1.0458 2.5338 6.6123 6.6182 9.8501 12.6306 1.0368 1.0970 1.0869 1.1015 1.0923 1.0996 1.0947
irintensity: 5.7349 1.6960 2.2518 6.1733 0.0017 1.5596 0.8566 2.0315 0.5737 0.0052 4.0627 8.6927 7.2195 0.2056 2.0058 3.3211 7.7217 8.9021 4.0282 6.2897 98.6913 68.8742 0.6836 6.1236 111.0953 1.4219 11.8288 10.0171 84.1780 486.8714 35.2343 34.2097 40.4991 1.4922 7.3849 62.8469 42.7896 25.6800 19.8441 63.2336 5.0906 16.8134 199.5110 24.4015 0.0829 3.7666 1.6792 9.5362 9.1409 12.7078 5.2908
temp: 298.150 k
press: 1.00000 atm
elementType: 8 8 7 6 6 6 6 6 6 6 6 6 1 1 1 1 1 1 1
symmnumber: 1
zpe: 359935.9 jmol-1
zpe.correction: 0.137092 hartree
zpe.thermalcorrener: 0.148171 hartree
zpe.thermalcorrenthalpy: 0.149115 hartree
zpe.thermalcorrgfe: 0.098666 hartree
zpe.sumelectzpe: -551.501368 hartree
zpe.sumelectthermal: -551.490289 hartree
zpe.sumelectthermalent: -551.489345 hartree
zpe.sumelectthermalfe: -551.539794 hartree
dipole: -0.7333 -2.6084 0.0065
dipole: 2.7095
quadrupole: -53.0921 -82.5913 -70.2210
quadrupole: 9.3403 0.0186 -0.0018
quadrupole: 15.5427 -13.9565 -1.5862 9.3403 0.0186 -0.0018
hfenergy: -551.6384602 hartree
pointgroup: C01 [X(C9H7N1O2)]
dipole: -0.5393633 0.9053167 -0.1607204 debye
dipolederiv: -2.0556806 -0.6879331 -0.0411712 -0.7125331 -0.6958777 0.019994 -0.0378197 0.0218035 -0.1744072 -0.6154756 0.0955327 -0.0353552 -0.453793 -1.0136542 0.0636838 0.0378966 0.1026183 -0.3001999 -0.22809 0.0651386 -0.0071982 0.0304987 -0.4010177 0.0223734 -0.0026047 0.0247988 -0.252106 1.2702003 0.3505248 0.036715 -0.1661471 0.1283814 -0.0164301 0.1060058 0.0200479 0.09688 -0.1289848 0.104505 -0.0285014 -0.0244356 -0.0297651 0.012592 -0.0115919 0.02163 0.0741342 -0.3800355 0.0081041 -0.0177435 0.205562 -0.063122 0.003592 -0.0440559 -0.0104326 -0.1462769 0.0606752 -0.1120609 0.0281571 0.0863389 0.0907169 -0.0229963 0.0018215 -0.0369249 -0.122634 0.1184103 0.0230612 0.0144421 -0.0318509 0.1575983 -0.0404811 0.0217943 -0.036599 -0.123517 0.0651552 -0.0238854 0.0189471 -0.0451671 -0.2483155 0.0085385 0.021702 0.0100776 -0.1601031 1.9395128 0.3311687 0.075048 1.0777288 1.5601591 -0.1009296 -0.0260345 -0.1539345 0.2422392 -0.3845078 0.1068307 -0.0399792 0.2421981 -0.0932779 0.0294731 -0.0542966 0.0195451 -0.001626 0.0349013 -0.1721665 0.0221709 -0.0784479 0.3444736 -0.0453086 0.0096878 -0.0518847 0.0523488 0.1459115 -0.0396501 0.0024721 -0.0241546 0.0704429 0.013672 0.0003616 0.012555 0.1840757 0.0554529 -0.0560951 -0.0001639 -0.0714985 -0.0130639 0.0185075 0.0019531 0.019578 0.1614758 0.0368253 0.0665437 -0.0172562 0.0841658 -0.044321 0.0326299 -0.0195849 0.0314008 0.1508127 -0.0991385 0.0140903 -0.0206953 0.0026397 0.0878957 0.0110018 -0.019173 0.0117894 0.1663376 0.090066 -0.0089493 0.0291704 -0.0157553 0.0976479 0.0765103 -0.0042756 0.0726409 -0.0088392 -0.0159331 -0.062705 -0.0033056 -0.105432 0.0082131 0.007334 0.0011934 0.0109494 0.1313163 0.0907349 -0.0020543 -0.0157531 0.0000829 0.056886 -0.0937565 0.0170206 -0.0896592 0.030089 unknown
polarizability: 141.1266651|-6.2215855|133.5313046|7.3890509|-11.8616494|49.5692637 unknown
InChI: InChI=1S/C9H7NO2/c1-7(11)12-9-5-3-2-4-8(9)6-10/h2-5H,1H3
charge 0 multiplicity 1
19 atoms
O  1.25634 0.147717 0.145495
O  1.977077 2.38218 -0.100638
N  0.337835 -3.188276 0.523127
C  -0.143454 0.329632 0.02192
C  -0.881621 -0.887181 0.131619
C  -0.805436 1.55974 -0.18848
C  -2.297303 -0.851986 0.027302
C  -2.215597 1.566531 -0.288594
C  -2.963472 0.371999 -0.182154
C  2.236675 1.178117 0.077106
C  3.59759 0.551137 0.254062
C  -0.202502 -2.136509 0.345323
H  -0.232131 2.482946 -0.271203
H  -2.857042 -1.788273 0.112456
H  -2.728424 2.520292 -0.451592
H  -4.054585 0.393675 -0.261511
H  3.646436 0.015834 1.217853
H  4.370971 1.331184 0.216111
H  3.775942 -0.19596 -0.538602
