program: Gaussian 09
title: 000000389
version: EM64L-G09RevD.01
frameworkgroup: C1[X(C5H12N2O2)]
method: RPBEPBE
basis: SDD
operation: Freq
keyword: #p
keyword: freq=noraman
keyword: PBEPBE/SDD
title: #p freq=noraman PBEPBE/SDD
converged: NO YES NO NO
title: Mulliken charges:
elementType: O O N N C C C C C H H H H H H H H H H H H
charge: -0.413671 -0.240232 -0.619202 -0.572391 -0.408846 -0.355707 -0.153046 -0.378530 0.153696 0.222375 0.207926 0.221661 0.201810 0.257188 0.177464 0.202619 0.311212 0.272167 0.261042 0.273419 0.379046
chargesum: 0.00000
title: Mulliken charges with hydrogens summed into heavy atoms:
elementType: O O N N C C C C C
charge: -0.034625 -0.240232 -0.035823 -0.037930 0.021455 0.067764 0.104142 0.001553 0.153696
polarizability: 7.83875292e+01 -3.97309065e+00 7.05610893e+01 1.38460676e+00 -4.30415666e-01 7.24360816e+01
1716.lowfreq: -24.7672 0.0006 0.0010 0.0010 3.7291 8.9258 44.7699 64.2805 68.3349
frequency: 43.4633 64.1112 68.3267 114.1288 143.1664 210.1620 219.2023 242.6543 286.4518 315.7968 407.7346 424.6376 493.3809 526.6485 578.7534 597.0763 634.0195 718.0701 752.3591 800.4433 849.7404 918.3270 967.9373 1033.3652 1049.7584 1066.4141 1094.3377 1117.5513 1152.7073 1182.0463 1217.8739 1239.1499 1266.9310 1277.2315 1287.6154 1314.8539 1357.9185 1387.2952 1389.3368 1459.1685 1470.9406 1493.1669 1606.6343 1639.0319 1667.3086 2860.2052 2963.2365 2970.3305 2984.6331 3004.8474 3027.6930 3053.7734 3454.7370 3490.4696 3515.4435 3582.6526 3630.8843
redmass: 4.7508 2.1555 3.9533 3.2173 2.8573 1.7745 1.5189 1.2209 3.5710 2.3471 3.5599 3.0345 1.8345 1.9589 2.3684 1.2893 1.7261 4.4382 1.1415 3.0495 1.4131 2.5812 1.8665 2.0511 2.3551 2.8266 2.0011 1.8423 1.2961 2.0018 1.5214 1.4468 1.5903 1.2185 1.1093 1.2706 1.4217 1.5856 1.6788 1.0933 1.0842 1.0891 1.3044 1.0943 3.8009 1.0716 1.0649 1.0659 1.0789 1.0848 1.0979 1.1015 1.0448 1.0450 1.0640 1.0976 1.0997
irintensity: 0.2022 3.3884 0.7308 1.0076 2.4499 29.8585 26.6904 55.2611 7.6073 6.6881 15.2983 62.3372 178.3175 79.6530 97.7917 220.4758 144.7073 22.7331 9.0968 2.3436 1.5037 1.0789 2.6253 23.4789 221.6618 51.8284 5.3626 19.7777 5.9929 6.3328 1.7335 5.5831 12.2984 2.1504 8.2876 4.1021 1.0227 23.4377 8.1094 2.9267 5.2811 4.6971 141.7898 41.2720 135.2966 114.4288 1.8962 29.8198 55.4117 44.0283 1.4363 73.8712 1.2760 9.5785 26.3653 0.2022 12.5828
temp: 298.150 k
press: 1.00000 atm
elementType: 8 8 7 7 6 6 6 6 6 1 1 1 1 1 1 1 1 1 1 1 1
symmnumber: 1
zpe: 464666.3 jmol-1
zpe.correction: 0.176982 hartree
zpe.thermalcorrener: 0.188278 hartree
zpe.thermalcorrenthalpy: 0.189222 hartree
zpe.thermalcorrgfe: 0.139378 hartree
zpe.sumelectzpe: -456.925331 hartree
zpe.sumelectthermal: -456.914035 hartree
zpe.sumelectthermalent: -456.913091 hartree
zpe.sumelectthermalfe: -456.962935 hartree
dipole: -1.9456 -1.3242 -1.9000
dipole: 3.0247
quadrupole: -55.2112 -48.1624 -60.0452
quadrupole: -1.7176 -0.2525 -1.7066
quadrupole: -0.7383 6.3105 -5.5723 -1.7176 -0.2525 -1.7066
hfenergy: -457.1023129 hartree
pointgroup: C01 [X(C5H12N2O2)]
dipole: -0.7682913 0.5551737 0.7194777 debye
dipolederiv: -0.4877345 -0.1475416 -0.1832998 -0.2173033 -0.8287809 -0.4787339 -0.1872661 -0.4099154 -0.589689 -0.4089441 -0.088496 0.13815 -0.1753531 -0.5379254 0.112291 0.1100002 -0.1487162 -0.9455265 -0.8051678 0.3178445 0.005512 0.2999126 -0.6171126 -0.2091338 0.0082904 -0.0956135 -0.3788391 -0.5158332 0.0785837 -0.1919299 0.0560405 -0.4743798 -0.2040545 -0.2368244 -0.1897993 -0.6115941 0.0254451 0.1392107 -0.0082737 -0.0104847 0.037733 0.0118848 0.0250086 -0.0775668 0.083805 -0.129525 0.0746781 -0.0233359 0.0767953 0.1254415 -0.0227336 0.0427198 -0.0157005 0.0068732 0.2175911 -0.2083025 0.127186 -0.2496633 0.3147158 0.2527998 0.1078949 0.3941254 0.2084823 0.4200934 -0.0212993 0.2311325 -0.0821323 0.3476272 0.011076 0.155481 0.0786123 0.4679695 0.463054 0.372294 -0.0690119 0.58132 1.0566553 0.1765398 -0.09803 0.2972366 1.3068151 0.0483386 0.0285025 -0.0060535 0.0186243 -0.0578331 -0.1367478 -0.0169115 -0.0985084 -0.0392387 -0.0103362 -0.0837327 0.0639619 -0.0477262 -0.0831204 0.1258255 0.0178701 0.1046039 -0.0035765 0.0920385 0.005069 0.0132448 -0.0124736 -0.0386958 -0.1043889 0.0019452 -0.0981177 -0.0374908 0.0242844 -0.0595819 0.0309338 -0.0546394 -0.0943848 0.1096858 0.0358546 0.0928577 -0.0104471 -0.0416956 0.0217036 -0.0907912 0.0210817 0.0203662 -0.0073072 -0.0908007 -0.0468985 -0.1013068 -0.0391513 -0.0071271 -0.0875478 -0.0015076 -0.107278 -0.1895025 -0.06417 -0.1370461 -0.2071116 0.016698 -0.0559796 0.0185616 -0.0758761 -0.0993162 0.1248792 0.0142313 0.0934334 -0.0300898 0.3468125 -0.0525702 -0.0939767 -0.0226726 0.2318011 0.0705536 -0.0449021 -0.0143412 0.1165688 0.2633149 -0.2376312 0.0521356 -0.1475941 0.1974514 0.0072253 0.0704906 -0.0243498 0.1536203 0.1689307 -0.0751962 -0.0039747 -0.0548121 0.0762118 0.1770903 -0.0348558 0.0948905 0.2271625 -0.0181152 0.0480498 0.0255102 0.1467463 0.2760587 0.0910419 0.0909062 0.0697621 0.1896391 0.3699016 -0.0484776 0.0518667 -0.0482823 0.2547651 0.0817091 0.0930678 0.1310515 0.1939745 unknown
polarizability: 78.559352|3.8066771|70.4123856|-1.4093522|-0.2885849|72.4129626 unknown
charge 0 multiplicity 1
21 atoms
O  1.998749 1.478073 0.768997
O  1.903797 0.569326 -1.364557
N  1.197917 -1.906344 -0.326036
N  -3.684492 0.470818 -0.7319
C  -0.366571 -0.394869 1.039717
C  -1.342462 -0.065031 -0.108398
C  1.091226 -0.75327 0.568913
C  -2.775862 0.194866 0.398931
C  1.702833 0.452118 -0.134986
H  -0.307434 0.448877 1.754758
H  -0.74416 -1.271001 1.606113
H  -1.376228 -0.89567 -0.838085
H  -0.986451 0.828989 -0.662535
H  1.688233 -0.921339 1.487821
H  -2.741619 1.010123 1.165125
H  -3.143446 -0.712131 0.918216
H  1.205409 -1.676349 -1.322835
H  0.627999 -2.7142 -0.072736
H  -3.409116 1.281669 -1.295691
H  -4.678046 0.497514 -0.484034
H  2.372125 2.255032 0.271002
