program: Gaussian 09
title: 000079796
version: EM64L-G09RevD.01
frameworkgroup: C1[X(C7H7ClN2S)]
method: RPBEPBE
basis: SDD
operation: Freq
keyword: #p
keyword: freq=noraman
keyword: PBEPBE/SDD
title: #p freq=noraman PBEPBE/SDD
converged: NO NO NO NO
title: Mulliken charges:
elementType: Cl S N N C C C C C C C H H H H H H H
charge: -0.012561 0.168969 -0.011573 0.060680 0.390294 0.094088 -0.765184 -0.742309 -0.324372 -0.000071 -0.740950 0.285791 0.285868 0.286275 0.286204 0.244178 0.247098 0.247575
chargesum: 0.00000
title: Mulliken charges with hydrogens summed into heavy atoms:
elementType: Cl S N N C C C C C C C
charge: -0.012561 0.168969 -0.011573 0.060680 0.390294 0.094088 -0.193525 -0.169830 -0.324372 -0.000071 -0.002099
polarizability: 1.37631790e+02 -4.21979205e+00 1.38033860e+02 6.78364701e-01 -3.91194606e-01 5.59854294e+01
1716.lowfreq: -18.6458 -0.0011 -0.0010 0.0020 6.0910 7.0191 27.1777 33.3847 84.0556
frequency: 26.6799 32.9651 83.8884 155.8754 173.4276 204.3577 254.2866 297.4751 374.2049 395.2346 464.1520 533.8110 546.7996 590.9556 611.5837 675.8689 703.9285 748.7694 762.6954 836.5822 863.6464 921.2702 926.2794 1007.4459 1050.2425 1096.1234 1125.7814 1140.4679 1198.5688 1219.0910 1252.9801 1279.1999 1351.9475 1386.1822 1404.6165 1438.9023 1444.2628 1453.7030 1460.8955 1491.9276 1548.8028 2994.3379 3019.7952 3025.6915 3080.6285 3085.5774 3089.6848 3135.9007
redmass: 1.0155 4.0671 3.1407 3.7289 14.5986 5.7244 3.3740 3.6543 12.5958 11.5268 4.8809 6.6776 4.2720 4.4702 6.1856 5.6245 6.0073 4.4652 6.1700 8.3600 1.3894 5.0704 1.5425 1.7659 1.6082 1.1320 1.1735 7.1965 1.3139 2.3347 2.1712 5.7102 5.3538 2.1244 2.2781 1.2661 1.1755 1.1247 1.0888 3.0217 10.7985 1.0418 1.0566 1.0569 1.1073 1.0901 1.1068 1.1023
irintensity: 0.4799 5.6335 2.5482 4.6860 0.2223 1.8852 2.7824 0.4614 8.6294 2.2909 5.1362 6.0230 0.1783 0.0351 8.1285 4.9857 4.3124 0.4980 9.3749 72.4037 9.7900 2.7226 0.0589 6.0765 10.5876 0.5065 0.0230 24.6208 0.3813 1.8487 16.4404 58.6138 11.2114 45.5818 172.0910 92.5280 12.6364 19.1988 37.7804 144.5223 123.7548 4.5537 10.3161 10.0784 3.1600 10.8782 4.2070 6.1159
temp: 298.150 k
press: 1.00000 atm
elementType: 17 16 7 7 6 6 6 6 6 6 6 1 1 1 1 1 1 1
symmnumber: 1
zpe: 334760.0 jmol-1
zpe.correction: 0.127503 hartree
zpe.thermalcorrener: 0.138062 hartree
zpe.thermalcorrenthalpy: 0.139007 hartree
zpe.thermalcorrgfe: 0.088754 hartree
zpe.sumelectzpe: -1237.772113 hartree
zpe.sumelectthermal: -1237.761554 hartree
zpe.sumelectthermalent: -1237.760610 hartree
zpe.sumelectthermalfe: -1237.810863 hartree
dipole: -0.0412 -1.0899 0.0735
dipole: 1.0931
quadrupole: -82.9755 -77.6466 -77.9447
quadrupole: -5.4186 0.2295 -0.1497
quadrupole: -3.4533 1.8757 1.5776 -5.4186 0.2295 -0.1497
hfenergy: -1237.8996165 hartree
pointgroup: C01[X(C7H7Cl1N2S1)]
dipole: 0.0603429 -0.4248617 0.0283315 debye
dipolederiv: -0.1333668 0.0582899 0.0004774 0.0658482 -0.9608552 -0.0012373 0.0015005 -0.0013104 -0.0855603 -0.0062931 0.027879 -0.000335 -0.0153022 -0.1374173 0.00045 0.0003885 0.0001357 -0.1665837 -0.9826204 0.1318965 -0.0034233 -0.0712396 -0.4212656 -0.0068748 0.0014157 -0.0021525 -0.1932492 -0.8619429 0.4481943 0.0042616 0.3147932 -0.8438207 0.0066961 0.0039749 -0.0016933 -0.1411899 -0.0454981 -0.2159643 0.0000037 -0.3955981 -0.8343517 -0.0001572 0.000166 -0.0018131 0.0600928 0.5388693 -0.0802124 -0.0003062 0.4480787 0.5195731 0.0011124 -0.0105126 0.0027653 0.0344143 0.0262907 0.1712085 0.0009265 0.2532522 0.2435838 0.0001493 0.0019756 -0.0003832 0.1502054 -0.0236218 -0.1947268 0.000631 -0.3546526 0.0497484 0.0007262 0.0002921 -0.0011368 0.11751 0.566328 -0.1420583 -0.0028938 -0.0876856 1.713437 -0.0001594 -0.0096014 0.0097518 0.0306551 1.0977991 -0.3066958 0.0203816 -0.3079378 0.5994324 -0.0076046 0.0764465 -0.0287672 0.0553689 -0.3404197 0.1438927 -0.0163483 0.1116656 -0.0071127 0.0077932 -0.1537592 0.0607285 0.0104759 0.0023121 -0.0449589 0.0031324 -0.0233362 -0.0161432 -0.0786815 0.0370418 -0.0753685 0.0057029 0.0026942 -0.0441011 -0.004278 -0.0222372 -0.0169678 0.0783407 -0.0376947 0.0753802 0.0070787 0.0006585 0.0381492 0.0165233 0.0418639 0.0099597 -0.0747834 -0.005905 -0.0896298 0.0105751 -0.0001713 0.0388517 -0.016504 0.0424516 0.0096132 0.0744281 0.0058954 0.089573 0.0105594 0.0483543 0.03156 -0.0398056 0.0389219 0.1138837 -0.0019094 -0.0549033 0.0078348 -0.0683408 0.0829659 -0.0349977 -0.0172541 0.025157 -0.0500845 -0.0769377 0.0380568 -0.0830048 0.0927233 0.027662 -0.0262066 0.0548109 -0.0640431 0.0287874 0.0786493 0.1052224 0.0390903 0.0695621 unknown
polarizability: 139.1236888|-4.0247005|136.545514|0.5287057|-0.1733715|55.9818775 unknown
InChI: InChI=1S/C7H7ClN2S/c1-4-9-6-3-11-2-5(6)7(8)10-4/h2-3H2,1H3
charge 0 multiplicity 1
18 atoms
Cl 0.331728 3.096508 0.000595
S  -3.228067 -0.584518 0.00664
N  0.736084 -1.47213 -0.01512
N  1.699466 0.750826 -0.014564
C  -0.714623 0.504784 0.000553
C  -0.500367 -0.900471 -0.004486
C  -2.138242 0.990351 0.007427
C  -1.739289 -1.767503 -0.000306
C  0.466883 1.275247 -0.003786
C  1.810364 -0.618695 -0.019378
C  3.194713 -1.209052 -0.004142
H  -2.370114 1.585541 0.906817
H  -2.377359 1.590934 -0.886407
H  -1.776752 -2.407442 -0.897558
H  -1.769464 -2.408753 0.896339
H  3.568028 -1.272929 1.036113
H  3.178588 -2.227595 -0.420909
H  3.892223 -0.567001 -0.564627
