program: Gaussian 09
title: 000079776
version: EM64L-G09RevD.01
frameworkgroup: C1[X(C9H9NO2S)]
method: RPBEPBE
basis: SDD
operation: Freq
keyword: #p
keyword: freq=noraman
keyword: PBEPBE/SDD
title: #p freq=noraman PBEPBE/SDD
converged: NO YES NO NO
title: Mulliken charges:
elementType: S O O N C C C C C C C C C H H H H H H H H H
charge: 0.917718 -0.521070 -0.521033 0.023666 -0.066125 -0.256568 -0.256489 0.446554 -0.587580 -0.359187 -0.358637 -0.795652 -0.042558 0.289836 0.289778 0.293990 0.294040 0.248620 0.248604 0.231926 0.231890 0.248277
chargesum: 0.00000
title: Mulliken charges with hydrogens summed into heavy atoms:
elementType: S O O N C C C C C C C C C
charge: 0.917718 -0.521070 -0.521033 0.023666 -0.066125 0.033268 0.033289 0.446554 0.000450 -0.110566 -0.110033 -0.083560 -0.042558
polarizability: 2.06019700e+02 2.26863068e-02 1.19173005e+02 3.91763376e-01 -9.60062029e-03 8.63369100e+01
1716.lowfreq: -34.6908 -10.1647 -6.7813 -0.0019 -0.0017 -0.0015 4.8051 8.8853 47.9422
frequency: -34.3703 -4.3955 47.9379 48.4908 115.3056 127.2399 157.8504 203.6502 220.0360 274.1134 294.2685 307.9314 356.4502 376.6090 383.6979 408.5572 460.4682 509.0978 574.2083 591.9748 620.3098 705.7391 775.3481 805.4237 826.1122 829.4036 851.0813 955.5625 963.0285 971.9870 982.6260 992.3615 992.5428 1049.6839 1050.4423 1118.0485 1134.6037 1172.5624 1184.4610 1217.2654 1296.3976 1381.4862 1386.6810 1388.7020 1400.6319 1470.4401 1471.0873 1474.9317 1591.3646 1595.0407 2193.4755 2984.2389 3056.5754 3067.2613 3094.9994 3137.5964 3138.5306 3147.1740 3157.1057 3160.6221
redmass: 1.0207 5.2590 4.1883 6.4286 6.3966 6.2657 6.1105 4.8402 8.4503 9.2625 4.2012 5.1950 3.3809 3.4827 11.9236 2.8714 5.5207 4.1680 5.7004 6.7662 6.9549 3.3614 4.9997 9.9334 1.7996 1.4070 1.2408 6.2318 1.3457 4.0805 1.4001 1.5116 4.4683 1.6727 2.3081 1.2777 1.1495 1.2099 1.1519 2.9809 1.2649 6.9481 1.1258 2.7989 1.2160 1.1019 2.3130 1.0657 5.9276 6.9585 12.3304 1.0388 1.0551 1.0951 1.1001 1.0883 1.0887 1.1102 1.0961 1.0975
irintensity: 0.7730 4.9303 2.8395 0.7173 2.4607 0.8386 0.9848 0.0376 8.7354 7.8423 0.8365 0.6575 0.4678 0.0055 23.8434 0.0044 52.0895 93.7374 18.7872 33.1146 0.2246 0.4076 3.3687 92.9536 3.8695 28.0445 0.4662 67.6619 0.7426 0.9409 0.5510 3.3591 1.7151 33.7565 18.5605 8.5870 0.0858 1.9753 9.7444 8.4904 2.8260 0.5122 12.4911 10.8346 17.6366 18.0517 23.1682 14.2335 11.0284 0.0394 6.1159 19.4703 2.9011 17.0760 13.8946 11.5198 3.0386 0.5925 1.1755 13.2367
temp: 298.150 k
press: 1.00000 atm
elementType: 16 8 8 7 6 6 6 6 6 6 6 6 6 1 1 1 1 1 1 1 1 1
symmnumber: 1
zpe: 414211.9 jmol-1
zpe.correction: 0.157765 hartree
zpe.thermalcorrener: 0.169890 hartree
zpe.thermalcorrenthalpy: 0.170835 hartree
zpe.thermalcorrgfe: 0.118641 hartree
zpe.sumelectzpe: -950.484414 hartree
zpe.sumelectthermal: -950.472288 hartree
zpe.sumelectthermalent: -950.471344 hartree
zpe.sumelectthermalfe: -950.523538 hartree
dipole: -8.7462 -0.0052 4.2902
dipole: 9.7417
quadrupole: -95.8044 -81.8565 -88.9914
quadrupole: -0.0185 3.5154 -0.0129
quadrupole: -6.9203 7.0276 -0.1073 -0.0185 3.5154 -0.0129
hfenergy: -950.6421787 hartree
pointgroup: C01 [X(C9H9N1O2S1)]
dipole: -3.4048885 0.0083258 1.7595784 debye
dipolederiv: 1.8558286 -0.0003112 0.0328603 0.0006948 1.1025679 0.0017891 0.2723743 0.0018729 1.4688008 -0.670077 0.0297063 0.0271835 -0.0145708 -0.5811819 -0.1904548 -0.0664436 -0.0162914 -0.5564665 -0.6699022 -0.029328 0.0277463 0.0141488 -0.5791147 0.1905015 -0.0665233 0.0164956 -0.5583629 -0.2248502 -0.000672 -0.1321941 0.0001163 -0.1873707 0.0000818 0.0482268 0.000159 -0.1485024 -0.1174786 0.0001018 0.010789 -0.0001538 -0.1245528 -0.0005671 -0.0456467 -0.0006502 -0.2349406 -0.1729512 0.0937303 -0.0233092 -0.2585542 -0.0240296 0.0314672 -0.0043589 -0.0530626 -0.0827677 -0.1730012 -0.0937614 -0.0223409 0.2585694 -0.0239097 -0.0321076 -0.0070806 0.0524749 -0.0830023 0.5826028 -0.0005316 -0.084516 0.0000108 0.0090902 -0.0001186 -0.0272652 -0.0001496 -0.0094322 -0.1418366 -0.0003532 -0.0614215 -0.0001533 0.0429106 -0.0007071 0.0206045 -0.0008056 -0.1502747 -0.2234819 -0.1301825 0.0079355 -0.121369 0.0671532 0.0136748 0.0105479 0.0139453 -0.1380247 -0.2231703 0.1305381 0.0065536 0.1216916 0.0666603 -0.0158411 0.0092663 -0.0160467 -0.1378147 -0.2531202 0.0000704 0.0299163 -0.0016632 0.0765389 0.0001237 -0.102279 -0.000008 0.0641109 0.0700928 0.0009057 0.1448271 -0.0005192 -0.0299133 -0.0004442 -0.2208021 -0.000561 -0.1559761 0.1266712 -0.0670481 0.0189713 -0.0463448 0.0672273 0.0009905 0.0079761 0.0220559 0.1438741 0.1266879 0.0672274 0.0182542 0.0464366 0.0667978 -0.0001641 0.0074561 -0.0212622 0.1440822 0.0349776 0.021203 -0.0228329 0.0664358 0.0477031 -0.0222575 0.0000695 -0.0243076 0.0467261 0.0350909 -0.0214733 -0.0226184 -0.0664075 0.0480199 0.0221256 0.0002669 0.0241559 0.046393 -0.0104658 0.0843949 0.0281536 0.080463 -0.0276212 -0.0099205 0.0411632 -0.0172655 0.1465773 -0.010582 -0.0840797 0.0290417 -0.0800497 -0.0271722 0.0117589 0.0420097 0.0190518 0.1462424 0.0495631 -0.0020965 0.0222114 -0.0724375 -0.0530298 0.1132563 0.0846827 0.0783795 0.0484498 0.0497403 0.0024075 0.0220557 0.0742508 -0.0562612 -0.1115668 0.0833765 -0.0767043 0.0516167 -0.040338 -0.0004481 -0.0572664 -0.0005949 0.1194878 -0.0016202 -0.087621 -0.0014761 -0.0513085 unknown
polarizability: 205.9835915|-0.0240686|119.1720541|-2.1151282|-0.1765101|86.3739692 unknown
InChI: InChI=1S/C9H9NO2S/c1-8-2-4-9(5-3-8)13(11,12)7-6-10/h2-5H,7H2,1H3
charge 0 multiplicity 1
22 atoms
S  1.399187 -0.004371 -0.725158
O  1.761864 -1.440645 -1.405909
O  1.764163 1.425022 -1.419141
N  4.87602 0.004258 0.922014
C  -0.443765 -0.0012 -0.282768
C  -1.092721 1.237655 -0.163627
C  -1.093948 -1.238043 -0.150292
C  -3.182702 0.003279 0.288921
C  2.243311 0.003197 1.10841
C  -2.475001 1.225126 0.129709
C  -2.476168 -1.220944 0.142957
C  -4.674868 0.005366 0.566429
C  3.684869 0.004125 1.00814
H  -0.546007 2.173041 -0.32419
H  -0.548263 -2.175682 -0.300853
H  1.83927 0.919109 1.565801
H  1.840882 -0.910258 1.572153
H  -3.01091 2.175998 0.226764
H  -3.013025 -2.170187 0.250191
H  -4.983178 -0.883381 1.143454
H  -4.983599 0.903548 1.128377
H  -5.248011 -0.002812 -0.380483
