program: Gaussian 09
title: 000079786
version: EM64L-G09RevD.01
frameworkgroup: C1[X(C14H14)]
method: RPBEPBE
basis: SDD
operation: Freq
keyword: #p
keyword: freq=noraman
keyword: PBEPBE/SDD
title: #p freq=noraman PBEPBE/SDD
converged: YES YES NO NO
title: Mulliken charges:
elementType: C C C C C C C C C C C C C C H H H H H H H H H H H H H H
charge: 0.488543 0.265175 -0.533626 0.267231 -0.398010 -0.397985 -0.379126 -0.379117 -0.671902 -0.385421 -0.385663 -0.219163 -0.219139 -0.241189 0.208560 0.208561 0.230202 0.230201 0.242255 0.242254 0.222299 0.215796 0.222302 0.244191 0.244107 0.225537 0.225451 0.227675
chargesum: 0.00000
title: Mulliken charges with hydrogens summed into heavy atoms:
elementType: C C C C C C C C C C C C C C
charge: 0.488543 0.265175 -0.116505 0.267231 -0.167808 -0.167784 -0.136871 -0.136863 -0.011505 -0.141230 -0.141556 0.006374 0.006312 -0.013513
polarizability: 2.18159608e+02 2.42951308e+00 1.13737844e+02 -1.24440838e-02 1.94443227e-02 1.08065729e+02
1716.lowfreq: -65.5800 -9.2401 -5.9972 -0.6238 -0.0008 -0.0005 0.0002 26.0116 50.4043
frequency: -65.5776 25.8777 50.3369 78.2306 133.7375 208.8119 241.1035 276.2688 290.9979 356.8129 397.0089 399.4299 431.5834 535.4303 540.6047 576.9411 616.8032 635.5078 690.8385 705.6528 747.7502 768.4621 783.1086 785.9429 838.8754 848.5006 853.2441 918.9930 953.9227 968.7512 970.2105 973.2276 987.1326 993.7015 996.2753 1019.2060 1042.0991 1042.1062 1062.4465 1076.4349 1121.0822 1171.2227 1185.6624 1190.3524 1215.2750 1239.9593 1286.2577 1303.9959 1307.4555 1310.5014 1363.4078 1368.3692 1386.8222 1400.2902 1427.8341 1470.1121 1471.8321 1475.8409 1489.5506 1512.8194 1570.9028 1583.0041 1611.3917 1623.6425 2978.1063 2984.5490 3035.1585 3076.4977 3082.4912 3113.2104 3115.1336 3120.7672 3127.0135 3139.6190 3140.2629 3145.9966 3148.2428 3163.1897
redmass: 3.7350 2.5705 4.0106 3.7873 3.8750 1.1773 4.6295 2.7965 4.4911 2.2697 2.8582 2.8354 4.5111 3.2423 3.8956 2.9654 5.7398 6.4189 4.7283 1.7006 3.7307 1.8906 4.5212 1.1843 1.5732 1.2467 1.2388 1.4077 1.3347 2.3672 1.3785 1.3810 6.2127 1.3064 6.8050 2.6286 1.8853 1.4556 2.0544 1.5994 1.3078 1.0531 1.1140 1.1039 2.3211 1.2632 2.8536 1.3356 1.3752 1.5436 4.3215 6.6531 1.1983 3.0256 2.2189 1.0433 1.5580 1.3271 1.0937 3.0055 6.7557 6.0034 6.2023 6.5952 1.0351 1.0596 1.1017 1.1001 1.1011 1.0878 1.0879 1.0843 1.0876 1.0925 1.0955 1.0969 1.0968 1.1018
irintensity: 0.0010 0.0434 0.5215 0.6434 0.0285 0.0106 0.0154 0.0494 0.3843 0.0006 0.0002 0.0001 0.2692 13.9770 10.2231 18.9817 0.9646 0.4832 1.4375 55.3851 0.0914 38.7976 0.9759 8.0497 50.0989 0.0180 0.0004 1.9157 0.2876 6.6454 0.0089 0.0024 0.0831 0.1343 19.6206 0.0013 6.1197 2.4864 19.0145 8.0163 7.4433 0.0276 1.1349 2.1848 0.0013 0.2571 0.0035 0.2313 0.5702 1.7051 1.9603 0.1655 9.3619 3.2062 6.8761 14.4514 22.3364 20.4114 12.3172 12.4097 0.0093 1.4645 5.5141 2.7256 42.5322 39.1833 8.8947 62.9704 40.5423 7.9324 27.7055 1.6669 0.5429 19.8359 32.9883 0.1142 41.4308 24.3640
temp: 298.150 k
press: 1.00000 atm
elementType: 6 6 6 6 6 6 6 6 6 6 6 6 6 6 1 1 1 1 1 1 1 1 1 1 1 1 1 1
symmnumber: 1
zpe: 611771.4 jmol-1
zpe.correction: 0.233011 hartree
zpe.thermalcorrener: 0.244547 hartree
zpe.thermalcorrenthalpy: 0.245491 hartree
zpe.thermalcorrgfe: 0.194116 hartree
zpe.sumelectzpe: -540.908589 hartree
zpe.sumelectthermal: -540.897054 hartree
zpe.sumelectthermalent: -540.896110 hartree
zpe.sumelectthermalfe: -540.947484 hartree
dipole: -0.5286 0.0578 -0.0002
dipole: 0.5317
quadrupole: -71.4927 -81.4232 -81.8115
quadrupole: 0.5609 -0.0030 0.0075
quadrupole: 6.7498 -3.1807 -3.5690 0.5609 -0.0030 0.0075
hfenergy: -541.1416007 hartree
pointgroup: C01 [X(C14H14)]
dipole: 0.207778 -0.0243739 -0.000044 debye
polarizability: 218.1912658|1.6111819|113.7060644|0.0044804|-0.032796|108.0658506 unknown
InChI: InChI=1S/C14H14/c1-2-12-8-10-14(11-9-12)13-6-4-3-5-7-13/h3-11H,2H2,1H3
charge 0 multiplicity 1
28 atoms
C  2.821465 0.315198 0.000457
C  -0.0431 0.109882 0.000177
C  4.342995 0.376411 0.000543
C  -1.542039 0.006904 0.000038
C  2.091746 0.266212 -1.214775
C  2.091801 0.262066 1.215555
C  0.682876 0.165067 -1.217704
C  0.682935 0.160913 1.21821
C  4.991272 -1.033922 -0.001674
C  -2.348146 1.17552 0.000762
C  -2.180166 -1.261286 -0.00083
C  -3.758553 1.079128 0.000622
C  -3.590477 -1.359078 -0.000977
C  -4.384575 -0.188932 -0.000248
H  4.696319 0.935645 -0.887206
H  4.696329 0.932838 0.890049
H  2.63205 0.3119 -2.168966
H  2.632166 0.304503 2.169863
H  0.137942 0.132283 -2.168236
H  0.138041 0.124918 2.168649
H  4.683469 -1.610781 0.889426
H  6.09465 -0.96153 -0.001607
H  4.683392 -1.608015 -0.89453
H  -1.864572 2.159127 0.001445
H  -1.566274 -2.169324 -0.001408
H  -4.366367 1.991231 0.001196
H  -4.067567 -2.345856 -0.00167
H  -5.477913 -0.264322 -0.00036
