program: Gaussian 09
title: 000079819
version: EM64L-G09RevD.01
frameworkgroup: C1[X(C10H12Cl3OPS)]
method: RPBEPBE
basis: SDD
operation: Freq
keyword: #p
keyword: freq=noraman
keyword: PBEPBE/SDD
title: #p freq=noraman PBEPBE/SDD
converged: YES YES NO NO
title: Mulliken charges:
elementType: Cl Cl Cl S P O C C C C C C C C C C H H H H H H H H H H H H
charge: -0.013518 -0.001464 -0.002319 -0.241252 0.563994 -0.492806 -0.583211 -0.597231 -0.632423 -0.636886 0.548167 -0.333015 -0.285573 -0.089759 -0.185466 -0.109635 0.257064 0.264009 0.286774 0.258295 0.226957 0.251631 0.246474 0.235866 0.218849 0.254439 0.308092 0.283948
chargesum: 0.00000
title: Mulliken charges with hydrogens summed into heavy atoms:
elementType: Cl Cl Cl S P O C C C C C C C C C C
charge: -0.013518 -0.001464 -0.002319 -0.241252 0.563994 -0.492806 -0.062138 -0.052162 0.092639 0.072268 0.548167 -0.333015 0.022518 -0.089759 0.098482 -0.109635
polarizability: 2.32756988e+02 -1.15628800e+01 2.02034468e+02 3.29135684e+00 1.34659412e+01 1.21351322e+02
1716.lowfreq: -8.1903 -7.7040 -5.6668 -0.0024 -0.0002 0.0019 7.1160 21.3856 38.5520
frequency: 4.1815 21.0000 38.4415 50.4170 67.3259 71.1102 117.6591 122.2081 132.0148 146.5282 165.8267 178.3426 181.4950 196.1960 223.1102 236.0739 245.3748 261.8214 310.7755 332.1027 349.2129 379.1885 410.1594 441.3708 445.5422 498.6607 513.0096 604.2040 619.4458 647.2412 654.8966 673.4490 691.2202 741.2364 761.7935 775.6165 851.6938 882.4710 889.4048 989.1541 994.0320 1023.3940 1030.8556 1037.2680 1051.3982 1066.7726 1117.7945 1229.3230 1236.2888 1242.8523 1247.4288 1267.5084 1270.6532 1324.6491 1364.4325 1397.3483 1398.0754 1418.7771 1428.1568 1447.2944 1469.8143 1473.1296 1479.8491 1485.1675 1551.0462 1581.6005 2989.5669 2994.7232 3013.0239 3014.8065 3075.4474 3080.8323 3089.0008 3091.8559 3100.6121 3109.8800 3142.4726 3180.4084
redmass: 5.5098 5.0389 3.3638 2.6152 14.9876 4.7771 4.0136 4.6241 7.6848 3.3015 1.9437 2.3765 10.3940 6.8515 4.5449 1.6896 2.1122 4.4549 16.3822 5.1499 11.0938 5.1950 7.7187 3.5093 6.9019 8.3379 7.4489 10.2535 7.9936 3.9323 6.9954 4.9208 3.8694 8.5093 1.2673 1.3197 1.4327 1.4103 7.9836 1.5044 1.6829 1.6538 3.7455 1.7160 2.0123 1.8213 1.8696 4.6963 1.2524 1.2462 1.2059 1.3089 1.3104 8.5797 10.1328 1.1839 1.1817 1.0815 1.0808 2.9970 1.0366 1.0390 1.0482 1.0469 9.0583 8.3831 1.0355 1.0354 1.0578 1.0583 1.1022 1.1030 1.1002 1.1002 1.1024 1.1022 1.0932 1.0930
irintensity: 0.7223 0.9667 0.9330 0.8421 1.0139 0.1958 0.6545 1.9511 0.1510 1.4019 1.1108 7.0441 0.9620 3.9553 1.3424 0.7033 4.1255 7.4367 0.2636 8.4333 3.8115 0.6887 4.9763 6.6055 14.8272 10.3754 35.8175 6.9306 40.5611 42.8631 45.3467 32.4006 0.4064 109.2663 55.3987 54.1571 5.5031 34.6610 69.0185 7.1370 7.7098 20.8534 137.7652 24.8968 7.1584 13.0267 58.2639 140.2033 6.9312 2.1696 4.9284 7.5592 6.0913 130.1851 10.5086 21.2660 18.4092 8.5774 9.8677 342.8985 17.2050 17.7235 11.6874 11.5592 8.8988 48.9157 27.9949 25.8241 8.0731 7.0193 3.6017 1.5560 15.8182 14.3224 17.9750 18.6982 14.4766 0.8630
temp: 298.150 k
press: 1.00000 atm
elementType: 17 17 17 16 15 8 6 6 6 6 6 6 6 6 6 6 1 1 1 1 1 1 1 1 1 1 1 1
symmnumber: 1
zpe: 517017.1 jmol-1
zpe.correction: 0.196921 hartree
zpe.thermalcorrener: 0.216399 hartree
zpe.thermalcorrenthalpy: 0.217343 hartree
zpe.thermalcorrgfe: 0.144172 hartree
zpe.sumelectzpe: -2581.749257 hartree
zpe.sumelectthermal: -2581.729779 hartree
zpe.sumelectthermalent: -2581.728835 hartree
zpe.sumelectthermalfe: -2581.802007 hartree
dipole: -4.0745 1.7646 3.3183
dipole: 5.5432
quadrupole: -123.2024 -136.6034 -130.1639
quadrupole: -1.4439 -7.5197 -5.6506
quadrupole: 6.7875 -6.6135 -0.1740 -1.4439 -7.5197 -5.6506
hfenergy: -2581.9461782 hartree
pointgroup: C01 [X(C10H12Cl3O1P1S1)]
dipole: -1.6026318 -0.4551766 -1.4073141 debye
polarizability: 231.8241586|13.6629138|193.6228942|-2.7977212|28.8874667|130.695725 unknown
InChI: InChI=1S/C10H12Cl3OPS/c1-3-15(16,4-2)14-10-6-8(12)7(11)5-9(10)13/h5-6H,3-4H2,1-2H3
charge 0 multiplicity 1
28 atoms
Cl 0.632214 -3.090484 -0.923206
Cl 2.812669 2.663737 0.91392
Cl 4.913478 0.31017 -0.048979
S  -2.44648 1.621512 1.763764
P  -2.404934 0.345765 0.123273
O  -1.019384 -0.804554 -0.030648
C  -3.716817 -0.995797 0.096442
C  -2.331021 1.202453 -1.555283
C  -3.73439 -1.811614 1.40245
C  -3.455186 2.242425 -1.732185
C  0.330826 -0.46374 -0.006546
C  1.250641 -1.469473 -0.406465
C  0.836915 0.794558 0.403009
C  2.224707 1.035674 0.387838
C  2.634335 -1.229921 -0.41495
C  3.126656 0.031649 -0.018978
H  -4.681126 -0.481728 -0.069906
H  -3.4924 -1.630915 -0.779025
H  -1.336547 1.67918 -1.617331
H  -2.374529 0.402362 -2.316455
H  -4.562617 -2.541634 1.372835
H  -2.788517 -2.363188 1.534272
H  -3.880689 -1.155266 2.278286
H  -3.328536 2.762243 -2.698325
H  -4.456208 1.774851 -1.72984
H  -3.424313 2.996367 -0.926372
H  0.154556 1.569258 0.767333
H  3.326497 -2.014189 -0.731126
