program: Gaussian 09
title: 000079773
version: EM64L-G09RevD.01
frameworkgroup: C1[X(C8H9NO2)]
method: RPBEPBE
basis: SDD
operation: Freq
keyword: #pfreq=noraman
keyword: PBEPBE/SDD
title: #p freq=noraman PBEPBE/SDD
converged: NO YES NO NO
title: Mulliken charges:
elementType: O O N C C C C C C C C H H H H H H H H H
charge: -0.252409 -0.252158 -0.042685 -0.171801 -0.312553 -0.309903 0.269799 -0.335811 -0.169030 -0.353812 -0.174625 0.234423 0.222181 0.236534 0.236469 0.221681 0.238579 0.241577 0.240424 0.233120
chargesum: 0.00000
title: Mulliken charges with hydrogens summed into heavy atoms:
elementType: O O N C C C C C C C C
charge: -0.252409 -0.252158 -0.042685 0.062622 0.146162 0.148248 0.269799 -0.097232 0.072546 -0.113388 0.058495
polarizability: 1.26262985e+02 2.85571192e+00 9.65202348e+01 -6.44719839e-02 1.54958032e-01 5.57326454e+01
1716.lowfreq: -11.9595 -1.2258 0.0004 0.0007 0.0007 9.9136 34.4077 99.2209 122.5201
frequency: 33.7843 99.0905 122.5095 138.1468 239.8258 304.3139 338.3371 401.7865 540.0482 605.6249 632.0300 680.1071 734.5556 751.1243 790.9533 826.4157 835.8094 851.5844 885.3187 901.6137 952.6364 957.0489 959.7540 968.6497 999.7775 1030.2569 1045.3441 1096.1830 1104.3180 1164.5861 1172.9169 1189.6317 1218.0527 1268.3425 1280.5273 1304.1566 1311.8526 1321.9860 1359.9733 1419.1686 1453.3962 1463.2114 1477.8315 1567.6456 1580.2115 3022.0565 3030.4618 3064.6624 3085.2309 3108.6084 3127.1354 3137.5344 3153.0738 3172.1329
redmass: 4.0808 2.0331 5.2877 3.5954 5.3244 5.0000 7.0852 3.5029 3.1172 7.6720 7.2457 6.1940 7.2665 1.4875 3.3917 1.4703 3.4822 2.9272 6.1857 1.3489 3.8128 4.6159 1.6123 7.1150 1.3482 4.5151 2.7613 1.6539 1.5574 1.0736 1.1467 1.1237 2.1318 1.1722 2.2402 3.1414 1.2332 1.2750 1.4288 1.9814 2.1671 1.0879 1.1015 5.8367 5.6890 1.0550 1.0580 1.0892 1.1102 1.1114 1.0885 1.0889 1.0945 1.1015
irintensity: 5.3743 0.2781 0.1294 7.3185 8.2278 0.9152 6.4750 2.9674 11.0775 15.1519 16.7172 9.4571 5.5922 58.7526 67.3811 13.2883 24.6980 19.7519 32.8675 0.0451 16.1239 20.2264 1.2515 14.1290 0.0140 86.4286 28.0642 0.1276 0.3363 2.2881 0.2834 0.1895 8.2989 0.1169 24.2405 1.6558 1.5797 3.1785 9.7893 15.9019 12.6306 5.2849 10.6439 6.8341 29.9440 29.5150 82.7249 17.9247 0.1343 57.0330 13.8262 2.7169 24.5483 20.7239
temp: 298.150 k
press: 1.00000 atm
elementType: 8 8 7 6 6 6 6 6 6 6 6 1 1 1 1 1 1 1 1 1
symmnumber: 1
zpe: 414394.4 jmol-1
zpe.correction: 0.157834 hartree
zpe.thermalcorrener: 0.166924 hartree
zpe.thermalcorrenthalpy: 0.167868 hartree
zpe.thermalcorrgfe: 0.122427 hartree
zpe.sumelectzpe: -514.596958 hartree
zpe.sumelectthermal: -514.587868 hartree
zpe.sumelectthermalent: -514.586924 hartree
zpe.sumelectthermalfe: -514.632365 hartree
dipole: -2.2833 0.8953 0.0648
dipole: 2.4534
quadrupole: -51.4819 -57.4811 -71.8870
quadrupole: 5.2895 0.1220 0.2417
quadrupole: 8.8014 2.8022 -11.6037 5.2895 0.1220 0.2417
hfenergy: -514.7547924 hartree
pointgroup: C01 [X(C8H9N1O2)]
dipole: -0.8881735 -0.3639883 0.1017033 debye
dipolederiv: -0.8107216 0.1380138 0.0405877 0.2038686 -0.5462751 -0.1430292 0.0052536 -0.0261118 -0.4990658 -0.7983647 0.0603117 -0.1496552 0.1311868 -0.4315994 0.0824954 -0.1717405 -0.0421946 -0.626311 -0.4756737 -0.0475785 0.0094245 -0.166619 -0.3282061 0.0480677 0.0649502 0.0517593 -0.2324257 1.118096 -0.0311765 0.0347952 0.0831849 0.5375819 0.0986979 -0.0044492 0.0956952 0.715608 0.4069334 -0.0562257 0.0255925 -0.1177991 0.3843869 0.0234472 0.1370445 -0.1178709 0.1042504 0.4230826 -0.0532451 0.0446868 -0.1694279 0.2773757 -0.2247423 0.009037 -0.0759323 0.2076283 0.4159391 0.095781 -0.0258044 -0.0908557 -0.0004836 -0.0343388 0.0504433 -0.0263338 -0.0529091 -0.4322117 -0.0518663 0.0095741 0.0441629 0.0366679 -0.0611773 -0.0391736 -0.0678414 -0.0672419 0.2257706 -0.0350857 0.0308448 0.0062087 0.0878844 -0.0878504 0.014895 -0.0883001 -0.0626281 0.1243013 -0.0840824 0.0485534 0.1241331 0.3022798 -0.1589927 -0.0480544 -0.1692682 0.016451 -0.0254019 0.1630514 -0.0693201 -0.0031446 -0.1920622 0.0318257 0.0056811 0.0378816 -0.1423616 -0.0047618 0.0604493 -0.0298571 0.0300191 -0.0925697 0.0711619 -0.0147514 0.0746555 0.0392752 -0.1739704 0.0778502 0.0780392 0.0382565 0.0615579 -0.0032334 0.0502316 -0.0121413 0.0521321 0.0681991 -0.1070929 -0.0171928 -0.0316727 -0.1253593 -0.0098116 -0.0430905 0.0283452 0.0566688 0.0651002 -0.0596842 0.0895919 0.0089925 -0.038064 0.1147355 0.0502732 0.0726046 -0.0244918 -0.1681455 -0.0108089 -0.1195533 -0.0190142 0.0614351 -0.0138555 -0.0711892 -0.0033793 0.0409303 0.0992503 -0.0426559 0.0163171 -0.0212502 -0.0462999 0.0912011 0.0057139 0.0905297 0.1139476 -0.0526203 0.0790352 -0.0456508 0.0835594 0.0580919 0.0444371 -0.0475443 0.0445372 0.1240185 0.0697225 -0.0113521 0.0023168 -0.0563896 -0.077236 0.0921216 0.0223232 0.0950798 0.0884995 -0.0745235 -0.0836386 0.0267099 -0.0773995 0.0708938 0.0388401 0.0241465 0.0382856 0.1480252 unknown
polarizability: 126.2773974|-0.8365285|89.4499276|3.3562596|-15.2871095|62.78854 unknown
InChI: InChI=1S/C8H9NO2/c1-2-4-9-7(3-1)8-10-5-6-11-8/h1-4,8H,5-6H2
charge 0 multiplicity 1
20 atoms
O  1.950398 0.255463 -1.244808
O  1.880649 1.175204 0.899687
N  -0.358338 -0.739835 0.399593
C  1.132482 1.083348 -0.353342
C  2.623617 -0.744044 -0.370419
C  2.588565 -0.124789 1.058591
C  -0.267398 0.508802 -0.162149
C  -1.408379 1.245893 -0.557636
C  -2.690781 0.68425 -0.365142
C  -1.599062 -1.269636 0.577197
C  -2.791779 -0.599453 0.215372
H  1.09034 2.095444 -0.789733
H  3.643073 -0.867165 -0.770592
H  2.066711 -1.695424 -0.403908
H  2.027533 -0.768031 1.756571
H  3.586118 0.120368 1.458035
H  -1.289961 2.237257 -1.007749
H  -3.589724 1.235417 -0.660801
H  -1.63471 -2.267375 1.030207
H  -3.763153 -1.074095 0.384925
