program: Gaussian 09
title: 000079765
version: EM64L-G09RevD.01
frameworkgroup: C1[X(C10H11NS)]
method: RPBEPBE
basis: SDD
operation: Freq
keyword: #p
keyword: freq=noraman
keyword: PBEPBE/SDD
title: #p freq=noraman PBEPBE/SDD
converged: NO YES NO YES
title: Mulliken charges:
elementType: S N C C C C C C C C C C H H H H H H H H H H H
charge: 0.202817 -0.021754 0.350501 0.369659 -0.394556 0.390528 -0.492260 -0.560810 -0.099450 -0.817741 -0.815416 -0.735047 0.248419 0.259751 0.232489 0.227248 0.227249 0.225475 0.225476 0.235062 0.241793 0.241793 0.258772
chargesum: 0.00000
title: Mulliken charges with hydrogens summed into heavy atoms:
elementType: S N C C C C C C C C C C
charge: 0.202817 -0.021754 0.350501 0.369659 -0.394556 0.390528 -0.243842 -0.301059 -0.099450 -0.130754 -0.129403 0.007312
polarizability: 2.06362012e+02 1.15014256e+00 1.30805246e+02 2.86001593e-03 5.32779913e-04 6.42989946e+01
1716.lowfreq: -11.6319 -2.6294 0.0009 0.0018 0.0023 9.8629 72.0139 94.2709 115.4599
frequency: 71.9192 94.2027 115.4397 124.8868 176.0522 203.5000 216.7635 290.5546 293.5637 321.1136 363.3180 382.1638 413.8645 441.8888 516.9678 528.1481 542.4681 571.2134 645.6620 677.0691 741.4741 747.3214 785.8806 872.3302 898.3489 957.7047 987.7978 1007.2187 1027.1046 1032.0734 1034.6956 1053.8217 1120.8565 1156.6465 1186.0446 1254.1188 1272.3631 1371.2083 1390.4027 1395.8607 1404.1451 1408.7333 1454.7354 1455.8765 1457.3650 1462.2736 1473.0663 1478.0941 1479.8690 1551.5822 1565.2221 1626.2884 2970.7212 2971.8410 2989.3179 3041.5394 3044.9265 3069.5136 3084.8352 3088.0348 3115.3872 3144.2362 3152.9596
redmass: 1.1197 2.7413 2.1258 1.3564 1.1663 3.2725 2.6987 3.8392 2.5308 3.7718 4.3500 5.9603 5.4010 2.8082 5.0027 6.0157 4.8407 4.6170 4.2367 6.5621 4.7637 3.7122 5.5037 1.3372 1.4412 2.6573 1.6687 1.5416 2.2458 1.4402 1.4249 1.6313 2.6076 3.1736 2.6699 1.2636 5.3934 5.0391 1.3427 1.2662 3.3571 1.2780 1.0446 1.2161 2.2497 1.0463 1.1947 1.0448 1.1754 6.3578 7.4067 7.3545 1.0376 1.0384 1.0368 1.0969 1.0969 1.0977 1.0984 1.0978 1.0990 1.0921 1.0923
irintensity: 1.4301 2.3894 1.0637 0.6511 0.0830 3.7581 0.2137 0.3255 0.3944 0.9712 4.1214 1.3320 0.3156 9.3757 11.6969 1.3435 23.4339 3.6755 0.0849 5.4706 0.3023 0.0993 9.0853 16.3440 15.0296 8.4412 23.6778 0.8696 3.0602 19.2084 1.1084 0.1328 43.0907 31.9145 0.8676 0.4663 0.8133 6.8489 13.0114 9.7796 0.6492 18.8036 20.0266 38.4856 17.3906 0.1862 26.8032 31.7340 0.6713 25.6996 32.9057 8.6699 63.6264 19.4212 19.0209 42.4091 1.5364 12.7271 35.3327 6.5778 6.3973 9.3759 4.5695
temp: 298.150 k
press: 1.00000 atm
elementType: 16 7 6 6 6 6 6 6 6 6 6 6 1 1 1 1 1 1 1 1 1 1 1
symmnumber: 1
zpe: 477158.0 jmol-1
zpe.correction: 0.181740 hartree
zpe.thermalcorrener: 0.193542 hartree
zpe.thermalcorrenthalpy: 0.194486 hartree
zpe.thermalcorrgfe: 0.144129 hartree
zpe.sumelectzpe: -839.628989 hartree
zpe.sumelectthermal: -839.617187 hartree
zpe.sumelectthermalent: -839.616243 hartree
zpe.sumelectthermalfe: -839.666600 hartree
dipole: 1.0111 -0.6573 0.0000
dipole: 1.2060
quadrupole: -62.3413 -77.8323 -81.5678
quadrupole: -0.2019 0.0004 0.0000
quadrupole: 11.5725 -3.9185 -7.6540 -0.2019 0.0004 0.0000
hfenergy: -839.8107289 hartree
pointgroup: C01 [X(C10H11N1S1)]
dipole: 0.4123307 0.2347274 -0.0000032 debye
dipolederiv: -0.4462744 -0.0935638 0.0000095 -0.0767665 -0.5013095 -0.0000017 0.0000075 0.0000026 0.0521411 -0.5277569 0.2804554 0.0000096 0.1253548 -0.7372461 -0.0000059 0.0000128 -0.0000157 -0.1820173 0.2460325 0.1300918 -0.0000042 0.1803747 0.0698891 -0.0000028 -0.0000089 -0.000002 -0.0506431 0.1468132 -0.2313325 -0.0000054 -0.3403234 0.0042626 0.0000074 -0.0000017 0.0000017 -0.0589555 0.4509032 -0.172812 -0.0000079 -0.2842082 -0.0835808 0.0000055 -0.0000094 0.0000009 -0.0940872 0.1799674 -0.0909447 -0.0000028 0.1065322 0.0174969 -0.0000021 -0.0000086 0.0000044 0.0662515 -0.2553527 0.0317299 0.0000012 0.1428619 0.063401 -0.0000001 0.0000041 0.0000016 -0.141306 -0.0130571 0.0964516 -0.0000024 0.0029384 0.0648247 0.0000025 -0.000003 0.0000008 -0.1627147 0.5363696 0.0679875 -0.0000162 0.2146169 1.0954736 0.0000016 0. 0.0000084 -0.0793952 -0.1517998 -0.0831191 0.0000033 0.0009189 0.0628391 0.0000006 0.00001 0.0000041 0.0669837 -0.0984432 0.106478 0.0000046 0.0486216 0.0442432 -0.0000005 -0.0000018 0.0000018 0.0724021 -0.234591 -0.0254126 0.0000071 -0.0344753 -0.030451 0.0000009 -0.0000093 -0.0000009 0.0729735 0.0700112 -0.0103979 0.0000011 -0.0370781 -0.0708269 -0.0000023 0.0000012 -0.0000025 0.1572611 0.0787392 -0.0082397 0.0000017 0.0108226 -0.0698044 -0.0000031 0.0000027 -0.0000031 0.1601601 0.0835565 0.0780874 0.0000027 -0.051485 -0.149779 -0.000007 -0.0000015 -0.000009 0.10931 -0.0521533 -0.0100617 -0.0838955 0.0100704 0.0744823 0.0810132 -0.1376788 0.036132 -0.0447793 -0.0521432 -0.0100696 0.0838957 0.0100577 0.0744886 -0.0810062 0.1376786 -0.0361253 -0.0447983 -0.0481074 0.0302355 0.0951301 -0.0037517 0.0723537 0.0692494 0.1421989 0.0152321 -0.0477011 -0.0481119 0.0302432 -0.0951284 -0.0037417 0.0723577 -0.0692408 -0.1421982 -0.0152255 -0.0477035 0.0748591 -0.10937 -0.0000034 0.0182981 -0.1377123 -0.000009 0.0000012 -0.0000068 0.1097498 0.0037515 0.0026363 0.0435423 0.0274164 0.067135 -0.0943184 0.1031677 -0.0665687 -0.0229551 0.0037379 0.0026379 -0.0435446 0.0274157 0.0671404 0.0943125 -0.1031676 0.0665655 -0.0229548 0.0530497 -0.0117108 0.0000018 -0.0944702 -0.0696778 0.0000063 0.0000043 0.0000035 0.1327781 unknown
polarizability: 205.9649202|-5.5828405|131.2023374|-0.0028237|0.0007002|64.2989946 unknown
InChI: InChI=1S/C10H11NS/c1-6-4-9-10(5-7(6)2)12-8(3)11-9/h4-5H,1-3H3
charge 0 multiplicity 1
23 atoms
S  -2.077495 1.623826 0.000072
N  -1.870934 -1.067637 0.000046
C  1.998457 0.685888 -0.000007
C  1.893812 -0.747648 -0.000023
C  -0.433771 0.857973 0.000041
C  -0.550168 -0.566699 0.000025
C  0.827383 1.481728 0.000026
C  0.621676 -1.356492 -0.000006
C  -2.775001 -0.115622 0.000083
C  3.360353 1.356021 -0.000025
C  3.146189 -1.605936 -0.000055
C  -4.261029 -0.308479 0.000115
H  0.916973 2.572756 0.000038
H  0.520922 -2.446508 -0.000018
H  3.266947 2.454942 0.000011
H  3.95608 1.067515 0.887465
H  3.956028 1.067572 -0.887568
H  3.77654 -1.406829 -0.888075
H  3.776544 -1.406889 0.887976
H  2.894187 -2.679534 -0.000091
H  -4.726114 0.151015 0.89128
H  -4.726147 0.150981 -0.89105
H  -4.481631 -1.387644 0.00014
