program: Gaussian 09
title: 000079771
version: EM64L-G09RevD.01
frameworkgroup: C1[X(C14H6N2O4)]
method: RPBEPBE
basis: SDD
operation: Freq
keyword: #p
keyword: freq=noraman
keyword: PBEPBE/SDD
title: #p freq=noraman PBEPBE/SDD
converged: NO NO NO NO
title: Mulliken charges:
elementType: O O O O N N C C C C C C C C C C C C C C H H H H H H
charge: -0.214277 -0.214290 -0.214284 -0.214281 -0.391394 -0.391379 0.218501 0.218500 0.167144 0.167137 0.167128 0.167134 -0.389172 -0.389176 -0.389171 -0.389169 0.055390 0.055385 0.055389 0.055388 0.286362 0.286365 0.286364 0.286363 0.362019 0.362023
chargesum: 0.00000
title: Mulliken charges with hydrogens summed into heavy atoms:
elementType: O O O O N N C C C C C C C C C C C C C C
charge: -0.214277 -0.214290 -0.214284 -0.214281 -0.029375 -0.029356 0.218501 0.218500 0.167144 0.167137 0.167128 0.167134 -0.102809 -0.102811 -0.102806 -0.102807 0.055390 0.055385 0.055389 0.055388
polarizability: 2.69757951e+02 -2.17728137e-04 2.33591376e+02 -1.96896179e-03 -1.29693322e-03 6.53217340e+01
1716.lowfreq: -0.0011 -0.0005 0.0003 4.8297 5.0068 9.9600 55.6878 83.9255 99.6005
frequency: 55.6878 83.9255 99.5975 155.5034 161.7942 206.1096 208.4942 247.2643 296.3997 296.6035 320.7774 353.0300 390.2423 401.7448 424.0640 447.0600 461.7843 465.5950 529.2102 530.8086 593.8720 604.0414 624.8377 644.1263 670.1638 678.0650 716.7276 735.8563 736.9328 742.1293 756.2817 788.3824 806.9900 808.4413 820.1917 897.5756 908.3503 910.3031 1013.4233 1014.9047 1015.7147 1089.2568 1105.2877 1123.7365 1174.8573 1186.2010 1208.3302 1245.5600 1285.4354 1299.8061 1315.7916 1371.3156 1371.3443 1372.7371 1411.0787 1429.7142 1436.6990 1460.4742 1518.2905 1570.8643 1591.8198 1604.8427 1621.6037 1622.7997 1627.8294 1641.0924 3156.1246 3156.3466 3172.1464 3172.1987 3491.6893 3491.9089
redmass: 14.3528 8.2531 7.9327 7.3387 10.2544 4.6900 12.3262 6.0973 5.7884 14.1385 10.0036 10.2558 7.2353 9.9225 10.9078 6.2420 8.2846 3.2917 5.7161 10.6608 7.6087 4.7058 7.6946 6.1181 3.5573 8.3728 4.8489 4.3027 8.0307 2.1470 7.6800 1.8915 5.6077 1.7736 3.8657 4.6296 1.4559 1.4732 4.9882 1.3853 1.3896 5.6305 2.3054 1.7148 3.3869 2.0587 1.6883 3.8969 8.3712 4.1319 2.2109 1.7251 1.7225 4.7634 11.6271 5.6888 10.8678 3.0495 5.4390 7.0371 8.4197 7.0533 10.4854 11.8799 5.0172 6.2164 1.0894 1.0894 1.0963 1.0962 1.0764 1.0765
irintensity: 0.0000 3.6059 0.0000 6.5102 0.0000 16.4417 7.2948 0.0000 0.0000 0.0000 0.0000 68.8554 0.0000 0.0000 11.7462 0.0000 4.3056 0.0000 0.4892 0.0000 0.0000 0.0000 31.4359 14.6268 0.0000 0.0000 0.0000 0.0000 2.5214 13.2411 0.0000 0.0000 8.5656 280.7112 0.0000 5.6335 0.0000 45.3162 0.0000 0.0000 0.0000 0.0000 70.0015 0.0000 34.0639 0.0000 12.8434 0.0000 386.8063 0.0000 368.6820 0.0040 0.0000 0.0000 1.4438 44.3295 0.0000 0.0000 0.0846 269.0929 0.0000 0.0001 286.9748 0.0228 719.5821 0.0002 0.2775 0.0000 0.0336 0.0000 145.3824 0.0018
temp: 298.150 k
press: 1.00000 atm
elementType: 8 8 8 8 7 7 6 6 6 6 6 6 6 6 6 6 6 6 6 6 1 1 1 1 1 1
symmnumber: 1
zpe: 460264.3 jmol-1
zpe.correction: 0.175305 hartree
zpe.thermalcorrener: 0.189165 hartree
zpe.thermalcorrenthalpy: 0.190110 hartree
zpe.thermalcorrgfe: 0.134760 hartree
zpe.sumelectzpe: -946.257094 hartree
zpe.sumelectthermal: -946.243234 hartree
zpe.sumelectthermalent: -946.242290 hartree
zpe.sumelectthermalfe: -946.297640 hartree
dipole: 0.0000 -0.0001 0.0002
dipole: 0.0002
quadrupole: -131.2769 -123.8030 -112.2225
quadrupole: 0.0006 -0.0014 -0.0002
quadrupole: -8.8428 -1.3688 10.2116 0.0006 -0.0014 -0.0002
hfenergy: -946.4323993 hartree
pointgroup: C01 [X(C14H6N2O4)]
dipole: 0.0000106 -0.0000217 0.0000904 debye
dipolederiv: -0.8977236 -0.3376592 -0.0000322 -0.3576578 -0.8908925 -0.000053 0.0000137 0.0000163 -0.3382977 -0.8977269 0.3376358 0.000025 0.3576335 -0.8908459 -0.0000354 0.0000011 0.0000098 -0.3383044 -0.8977297 0.3376442 -0.0000449 0.3576488 -0.890867 0.0000733 0.0000047 -0.000003 -0.3383015 -0.8977168 -0.3376467 -0.0000051 -0.3576545 -0.8908759 -0.000013 -0.0000028 -0.0000026 -0.3382998 -0.5076966 0.000009 0.0000235 0.0000157 -1.3622782 0.0000145 0.0000679 0.0000198 -0.3197856 -0.5076954 0.0000071 -0.0000015 0.0000102 -1.3622701 -0.0000123 -0.0000106 -0.0000258 -0.3197698 -0.1815288 -0.0000043 -0.0000026 0.0000148 -0.0318093 -0.0000011 -0.0000078 -0.0000044 0.0045171 -0.1815276 0.0000068 0.000002 0.0000113 -0.0318176 0.0000059 0.0000153 0.0000128 0.0045117 -0.5448594 0.0080931 0.000013 0.1236293 0.0645398 -0.0000066 -0.0000011 -0.000009 0.0329189 -0.5448028 -0.0081155 0.0000039 -0.1236518 0.0645532 -0.000003 0.0000197 0.0000024 0.0329258 -0.5448035 -0.0081082 0.0000103 -0.123643 0.0645414 0.0000053 -0.0000053 0.0000052 0.0329207 -0.5448391 0.0080934 0.0000014 0.1236288 0.064542 -0.0000039 -0.0000034 -0.0000068 0.0329217 0.0715168 0.2913462 -0.000007 0.0386936 -0.0226634 -0.0000036 -0.0000369 -0.0000008 -0.0918882 0.0714942 -0.2913458 0.0000038 -0.038708 -0.0226778 -0.0000073 0.0000209 -0.0000038 -0.0918892 0.0714956 -0.2913449 0.0000016 -0.0387059 -0.0226761 -0.0000017 -0.0000323 -0.0000089 -0.0918898 0.0715089 0.2913441 -0.0000019 0.0386945 -0.0226631 0.0000067 -0.000002 0.0000102 -0.0918888 1.5083202 -0.0576636 0.0000151 0.0895128 1.4245682 0.0001518 0.0000011 0.0000833 0.2370105 1.5082589 0.0576926 -0.0000249 -0.0894812 1.4245162 0.0000501 -0.0000366 0.0000117 0.2369995 1.5082737 0.0576806 0.0000161 -0.0895062 1.4245447 -0.0001897 0.0000056 -0.0001169 0.2370058 1.5083005 -0.0576714 0. 0.0895144 1.4245458 0.0000204 0.0000132 0.0000093 0.2370049 0.0830772 -0.0643402 0.0000037 -0.0317833 0.0573178 0.0000026 0.0000025 0.0000005 0.1516721 0.0830775 0.0643395 -0.0000014 0.0317822 0.0573245 0.0000023 0.0000043 0.0000049 0.1516729 0.0830778 0.0643402 0.0000008 0.0317821 0.0573241 0.0000008 0.0000054 0.0000073 0.1516727 0.0830792 -0.0643377 -0.0000005 -0.0317827 0.0573193 -0.0000004 0.0000039 -0.0000085 0.1516726 0.248582 0.0000031 0.0000002 -0.0000012 0.1283488 0.0000035 -0.0000466 0.0000024 0.3324441 0.2485874 0.0000018 0.0000014 0.0000036 0.1283515 -0.0000062 0.0000063 -0.0000055 0.3324436 unknown
polarizability: 269.7579513|0.0002924|233.5913763|-0.0019689|-0.001297|65.321734 unknown
InChI: InChI=1S/C14H6N2O4/c17-11-5-1-2-6-10-8(14(20)16-12(6)18)4-3-7(9(5)10)13(19)15-11/h1-4,15-16H
charge 0 multiplicity 1
26 atoms
O  -3.607226 -2.32478 0.000003
O  3.607283 -2.324677 -0.000064
O  -3.607285 2.324679 -0.000067
O  3.607214 2.324778 -0.000002
N  -3.533221 -0.00005 0.000223
N  3.533211 0.000046 -0.000027
C  -0.71974 -0.000018 -0.000019
C  0.719733 0.000009 -0.000032
C  -1.419873 -1.251056 0.000012
C  1.419901 -1.251015 -0.000022
C  -1.41991 1.251001 -0.000039
C  1.419864 1.251044 -0.000031
C  -0.710463 -2.462909 0.000037
C  0.710535 -2.462888 0.000018
C  -0.710541 2.462879 -0.000033
C  0.710457 2.462902 -0.000042
C  -2.914245 -1.270855 0.000011
C  2.914281 -1.270751 -0.000083
C  -2.914292 1.270756 -0.000038
C  2.914243 1.270839 -0.000007
H  -1.274503 -3.40113 0.000061
H  1.274603 -3.401091 0.000037
H  -1.274611 3.40108 -0.000038
H  1.274492 3.401126 -0.00003
H  -4.561022 -0.00008 0.000313
H  4.561012 0.000061 -0.00004
