program: Gaussian 09
title: 000080034
version: EM64L-G09RevD.01
frameworkgroup: C1[X(C16H35O3P)]
method: RPBEPBE
basis: SDD
operation: Freq
keyword: #p
keyword: freq=noraman
keyword: PBEPBE/SDD
title: #p freq=noraman PBEPBE/SDD
converged: YES YES NO NO
title: Mulliken charges:
elementType: P O O O C C C C C C C C C C C C C C C C H H H H H H H H H H H H H H H H H H H H H H H H H H H H H H H H H H H
charge: 1.279588 -0.544797 -0.504267 -0.625101 -0.360410 -0.315769 -0.382758 -0.793934 -0.370999 -0.353649 -0.356418 -0.247437 -0.260912 -0.350815 -0.355953 -0.695812 -0.347896 -0.346958 -0.683978 -0.682897 0.190128 0.197334 0.215722 0.231423 0.193571 0.198807 0.260718 0.286336 0.188573 0.191318 0.190231 0.188022 0.194224 0.195542 0.237306 0.200851 0.190101 0.222492 0.202570 0.206677 0.210658 0.209993 0.215624 0.210683 0.209675 0.193595 0.199904 0.193453 0.192127 0.209951 0.217956 0.212589 0.213125 0.216567 0.213327
chargesum: 0.00000
title: Mulliken charges with hydrogens summed into heavy atoms:
elementType: P O O O C C C C C C C C C C C C C C C C
charge: 1.279588 -0.544797 -0.504267 -0.625101 0.027052 0.131376 0.009620 -0.246881 0.008892 0.024604 0.033348 0.190719 0.151682 0.058432 0.064698 -0.059830 0.045604 0.038623 -0.043483 -0.039878
polarizability: 2.57851617e+02 6.12517143e+00 2.09366180e+02 2.32062998e+00 -3.23456014e+00 1.77358291e+02
1716.lowfreq: -5.4699 -0.0013 -0.0010 0.0013 4.1470 5.6037 9.1736 12.5987 20.4222
frequency: 5.5545 12.3463 20.3435 28.4996 36.7290 44.5341 50.2246 56.1803 69.3427 76.5364 91.5317 92.8078 101.7809 109.2848 109.6708 114.8022 131.4506 139.0320 147.7271 153.1514 163.4060 188.1151 190.8851 227.6847 231.2238 233.3995 239.2139 258.5469 287.4174 309.0379 323.5817 365.9342 384.6602 400.0808 436.2310 440.5904 467.2388 495.2615 635.7452 697.9237 723.5247 732.0135 737.9220 741.3760 741.9972 754.1019 788.5634 801.2958 804.0244 850.7540 889.3895 898.7362 899.8404 926.1319 932.5228 933.6608 937.5809 947.0999 986.6320 997.8631 1018.5270 1033.7289 1037.4816 1039.6605 1041.1127 1064.5002 1077.9745 1079.4568 1080.1978 1080.4521 1097.4166 1117.1775 1117.8779 1120.5611 1141.9287 1149.0611 1185.8930 1209.3605 1212.8929 1215.4510 1220.5388 1253.1220 1258.3737 1268.7343 1272.2344 1273.7553 1275.4548 1282.7838 1284.5565 1284.8141 1288.6267 1288.6963 1296.9260 1304.4740 1326.2466 1343.7035 1345.3178 1350.8237 1356.7942 1359.7446 1367.9122 1370.5052 1390.6266 1390.9451 1391.6081 1424.7223 1462.4225 1462.5110 1467.2435 1468.5737 1469.6388 1472.5059 1473.6769 1475.3658 1477.0209 1477.7191 1478.3677 1479.6027 1482.9658 1485.3406 1486.4433 1489.4511 1491.1635 1493.5420 2947.8092 2950.8079 2953.4606 2955.5460 2962.7914 2967.0015 2968.2126 2969.5013 2972.0485 2974.8839 2975.9620 2976.6248 2985.4290 2986.3700 2992.1087 2994.2287 2997.6431 3005.3402 3009.9117 3013.4252 3016.2395 3018.7607 3022.3664 3032.8294 3036.5929 3048.3815 3061.5818 3062.4151 3068.5635 3071.0159 3074.8747 3075.7489 3075.9131 3076.2371 3087.5547
redmass: 3.1377 4.0714 4.2376 2.2357 2.9287 1.5247 2.2718 3.4535 2.5728 3.0447 1.7664 2.7004 2.3863 2.7775 2.4715 2.2478 3.0129 1.8131 4.4738 2.2264 3.5479 4.4101 3.5268 2.4998 1.3695 1.1302 1.1265 5.4682 3.6746 3.7172 4.2401 4.0984 4.7092 3.8818 3.2204 3.6280 3.6586 4.4216 7.5238 10.0710 1.0638 1.1119 2.3730 1.0752 1.0720 1.4348 1.2526 1.1340 1.1354 1.2646 1.8867 1.8020 1.8018 1.2896 1.4420 1.2156 3.2116 6.6722 4.9273 1.3025 3.2725 3.3836 3.4513 3.5057 2.5699 3.0742 2.3878 2.2092 2.1968 2.2090 1.6838 2.5024 2.5148 2.6002 1.4349 1.4839 1.7815 1.3848 1.3534 1.2712 1.4415 1.2899 1.2825 1.2874 1.2820 1.1495 1.1582 1.0315 1.0811 1.0855 1.1630 1.2987 1.0861 1.1016 1.3564 1.4294 1.4118 1.4885 1.6390 1.5314 1.4301 1.4023 1.2178 1.2149 1.2134 1.0803 1.0716 1.0728 1.0698 1.0753 1.0749 1.0745 1.0667 1.0631 1.0428 1.0425 1.0423 1.0762 1.0709 1.0735 1.0837 1.0942 1.0902 1.0892 1.0585 1.0588 1.0587 1.0592 1.0593 1.0589 1.0588 1.0583 1.0365 1.0444 1.0494 1.0363 1.0933 1.0630 1.0591 1.0985 1.0598 1.1018 1.0999 1.0999 1.1027 1.0582 1.1037 1.1050 1.1043 1.1041 1.1056 1.1045 1.1007 1.0993 1.1016 1.1000 1.1008 1.1001 1.1041
irintensity: 0.0179 0.0461 0.6101 0.9247 0.5086 0.0312 0.7748 0.6207 1.0110 0.8621 0.0930 0.2221 1.3395 0.8758 0.4789 2.3943 1.7148 0.1062 2.0508 0.2517 2.6502 11.2937 3.4389 0.3168 0.3955 0.0265 0.0791 7.6361 0.9785 3.0156 15.4434 11.0620 18.9984 8.8145 1.3751 3.5990 13.7914 23.0090 32.8135 178.7201 12.9204 1.5553 34.0861 7.1717 8.3131 47.1782 9.5329 0.2829 1.3448 7.0184 4.8624 26.0811 22.2730 5.9119 57.2154 9.5278 210.1526 174.3007 0.1717 2.9248 5.9995 61.3009 13.2903 20.4363 21.7005 1.0387 0.4253 7.1540 8.1549 0.5667 41.4967 7.8312 24.8996 9.6077 1.8953 2.3058 1.5218 0.3232 3.6916 19.1857 1.6045 3.7075 0.7636 2.7787 2.7508 0.5079 2.1396 0.5953 0.1211 0.1601 0.9778 1.7842 0.0157 0.4012 0.4760 0.0856 0.1232 0.7988 0.3661 0.7986 11.7498 16.4564 11.4274 7.4034 8.2049 9.9080 0.0135 0.0380 0.5525 0.6231 0.1282 0.4335 1.2204 0.4104 12.6438 12.2415 12.8751 3.0337 5.7156 4.4721 2.2255 43.7006 10.3258 10.0513 33.1597 0.0576 4.1725 0.1677 17.2293 34.3974 146.9320 18.4662 37.9594 28.8364 40.8666 36.5217 0.8654 27.3481 51.2616 1.2494 36.3907 1.1540 16.6611 6.2091 9.8664 11.9223 0.1022 0.7568 58.1960 89.9369 11.9640 14.4506 93.0367 54.8868 101.5852 20.6150 129.8258 63.3869 17.9157
temp: 298.150 k
press: 1.00000 atm
elementType: 15 8 8 8 6 6 6 6 6 6 6 6 6 6 6 6 6 6 6 6 1 1 1 1 1 1 1 1 1 1 1 1 1 1 1 1 1 1 1 1 1 1 1 1 1 1 1 1 1 1 1 1 1 1 1
symmnumber: 1
zpe: 1279808.2 jmol-1
zpe.correction: 0.487453 hartree
zpe.thermalcorrener: 0.515878 hartree
zpe.thermalcorrenthalpy: 0.516822 hartree
zpe.thermalcorrgfe: 0.421243 hartree
zpe.sumelectzpe: -1195.906083 hartree
zpe.sumelectthermal: -1195.877658 hartree
zpe.sumelectthermalent: -1195.876714 hartree
zpe.sumelectthermalfe: -1195.972293 hartree
dipole: 0.3643 1.2115 -4.2755
dipole: 4.4587
quadrupole: -122.0905 -129.9719 -148.7964
quadrupole: -1.7923 5.1709 0.8874
quadrupole: 11.5291 3.6477 -15.1768 -1.7923 5.1709 0.8874
hfenergy: -1196.3935363 hartree
pointgroup: C01 [X(C16H35O3P1)]
dipole: 0.1254812 0.5321344 -1.6668085 debye
polarizability: 257.0937562|8.4567831|210.2562355|3.0281415|-2.1214463|177.2260964 unknown
InChI: InChI=1S/C16H35O3P/c1-4-7-10-11-12-13-16-20(17,18-14-8-5-2)19-15-9-6-3/h4-16H2,1-3H3
charge 0 multiplicity 1
55 atoms
P  -1.333213 -0.74957 0.849705
O  -2.588981 -1.166444 -0.290725
O  -1.456013 0.984703 1.047003
O  -1.421878 -1.473383 2.262473
C  2.720901 -0.907508 -0.391646
C  1.473963 -0.538841 0.444663
C  4.032637 -0.363449 0.217632
C  0.176611 -1.065156 -0.203867
C  5.286036 -0.742221 -0.603235
C  6.599051 -0.189375 -0.004842
C  7.852973 -0.57295 -0.823646
C  -3.936489 -1.523316 0.236775
C  -1.631829 1.850019 -0.148269
C  -4.652303 -2.319384 -0.856261
C  -2.033983 3.235738 0.36261
C  9.160412 -0.014874 -0.221103
C  -6.087214 -2.718861 -0.434922
C  -2.214563 4.252013 -0.790142
C  -6.818236 -3.524082 -1.530799
C  -2.629471 5.649303 -0.280642
H  2.605821 -0.514901 -1.423888
H  2.789057 -2.011529 -0.482678
H  1.417114 0.561365 0.562548
H  1.574941 -0.959018 1.464622
H  3.968668 0.741655 0.300353
H  4.142717 -0.746648 1.253282
H  -0.008658 -0.60231 -1.189868
H  0.217234 -2.160083 -0.34694
H  5.171537 -0.367659 -1.64231
H  5.354798 -1.847848 -0.677566
H  6.714601 -0.560621 1.035055
H  6.533963 0.916738 0.066397
H  7.735986 -0.203655 -1.863181
H  7.918276 -1.678166 -0.892498
H  -3.818112 -2.115924 1.16483
H  -4.483212 -0.590146 0.477641
H  -0.675254 1.902253 -0.711164
H  -2.409973 1.420819 -0.810524
H  -4.687931 -1.713089 -1.78223
H  -4.059802 -3.225538 -1.086641
H  -2.973341 3.143508 0.940357
H  -1.259743 3.595353 1.06696
H  10.041077 -0.30335 -0.82408
H  9.315832 -0.39345 0.806913
H  9.133017 1.090104 -0.169756
H  -6.669803 -1.80604 -0.195488
H  -6.0454 -3.316635 0.497909
H  -2.978829 3.875499 -1.500462
H  -1.268349 4.334315 -1.363283
H  -6.898592 -2.93896 -2.466191
H  -7.840994 -3.798243 -1.213959
H  -6.274392 -4.458361 -1.764968
H  -1.869704 6.060627 0.409896
H  -2.750582 6.363094 -1.115803
H  -3.589075 5.602083 0.26715
