program: Gaussian 09
title: 000079743
version: EM64L-G09RevD.01
frameworkgroup: C1[X(C9H12O3)]
method: RPBEPBE
basis: SDD
operation: Freq
keyword: #pfreq=noraman
keyword: PBEPBE/SDD
title: #p freq=noraman PBEPBE/SDD
converged: YES YES NO NO
title: Mulliken charges:
elementType: O O O C C C C C C C C C H H H H H H H H H H H H
charge: -0.225064 -0.161936 -0.164137 0.354171 -0.508735 -0.476358 -0.455327 -0.444898 -0.573973 -0.594993 0.195757 0.207017 0.228473 0.213795 0.210967 0.243135 0.233754 0.220260 0.221823 0.231270 0.252715 0.273621 0.263250 0.255414
chargesum: 0.00000
title: Mulliken charges with hydrogens summed into heavy atoms:
elementType: O O O C C C C C C C C C
charge: -0.225064 -0.161936 -0.164137 0.354171 -0.066467 -0.022256 -0.001313 0.008195 -0.047637 -0.076330 0.195757 0.207017
polarizability: 1.06352316e+02 5.09797806e+00 1.08213599e+02 -4.52429236e+00 -6.93454424e-02 8.08008307e+01
1716.lowfreq: 0.0006 0.0006 0.0008 10.7511 14.1204 21.9021 39.4071 66.9133 99.8698
frequency: 38.1836 66.7812 99.7948 118.3825 151.9398 225.6284 321.0236 336.9817 348.0015 393.1561 436.8144 495.7241 511.8605 553.9200 575.7079 632.2712 649.4749 748.9333 770.2091 807.1013 824.1205 857.7995 885.2364 889.6352 922.7977 934.7243 970.8074 1021.1898 1026.1102 1044.8970 1065.3987 1092.5707 1109.6835 1164.0056 1172.4075 1183.3447 1206.4861 1224.0955 1250.1814 1272.2862 1279.3119 1289.1791 1304.5622 1316.9655 1332.3367 1340.1496 1429.5255 1442.1986 1465.1166 1477.3281 1478.1606 1495.9456 1678.9581 1717.5978 2975.8697 2979.7081 2984.5473 2993.1904 3002.2853 3017.9133 3042.0127 3051.4315 3061.3405 3068.8298 3081.5287 3085.0564
redmass: 4.3195 1.7802 5.3347 8.2871 2.5066 2.3051 2.5732 5.3011 3.3272 3.1997 3.8903 7.1481 2.8454 4.7223 3.6238 2.9453 2.6676 1.9570 3.1397 1.7400 2.1401 7.8532 2.5577 2.0696 2.2663 2.0452 2.1909 1.9749 3.8368 1.7852 2.1392 2.0426 2.7381 2.4926 1.2362 1.3998 1.5037 1.1646 1.6757 1.3829 1.4758 1.3086 1.3793 1.5277 1.4866 1.9154 1.0747 1.0800 1.0801 1.0814 1.0833 1.0953 12.4788 12.2113 1.0659 1.0666 1.0604 1.0609 1.0631 1.0669 1.0995 1.1005 1.1041 1.0939 1.0975 1.0993
irintensity: 0.1729 0.8204 5.6245 0.6598 1.5092 1.2718 2.0518 4.6315 0.4514 4.4947 6.1946 5.4718 9.7091 30.9719 17.6828 1.5891 2.6686 19.9968 3.5171 0.8648 0.6625 188.9117 0.4673 6.3653 19.6823 8.9847 11.6392 29.3863 275.3367 36.5027 1.3080 22.9677 4.0437 50.7639 31.0036 11.4626 13.8191 1.7794 4.2211 4.1239 5.4740 0.4116 1.7680 1.3865 3.8076 8.4217 9.8473 19.2847 6.7153 8.4306 9.8756 7.1801 376.0184 160.3961 4.7695 11.5144 33.2414 30.4665 29.9412 35.6570 27.4006 10.2688 1.7614 5.5427 38.0767 50.3258
temp: 298.150 k
press: 1.00000 atm
elementType: 8 8 8 6 6 6 6 6 6 6 6 6 1 1 1 1 1 1 1 1 1 1 1 1
symmnumber: 1
zpe: 513142.4 jmol-1
zpe.correction: 0.195446 hartree
zpe.thermalcorrener: 0.206380 hartree
zpe.thermalcorrenthalpy: 0.207324 hartree
zpe.thermalcorrgfe: 0.157944 hartree
zpe.sumelectzpe: -574.919718 hartree
zpe.sumelectthermal: -574.908784 hartree
zpe.sumelectthermalent: -574.907840 hartree
zpe.sumelectthermalfe: -574.957219 hartree
dipole: 6.1349 -1.7558 -2.1721
dipole: 6.7408
quadrupole: -84.8475 -80.2678 -67.3264
quadrupole: 0.3356 4.6088 0.3680
quadrupole: -7.3669 -2.7872 10.1541 0.3356 4.6088 0.3680
hfenergy: -575.1151639 hartree
pointgroup: C01 [X(C9H12O3)]
dipole: 2.4254796 -0.5647424 -0.9117737 debye
dipolederiv: -0.6036018 -0.326191 0.1010887 -0.327189 -1.8773846 0.031825 0.1186109 0.02865 -0.2631125 -0.5406415 0.1783562 0.0653363 0.0877957 -1.1398223 -0.0468914 0.1168629 -0.1634965 -0.3372441 -0.7850212 -0.3851247 0.1086132 -0.2792822 -0.9109482 0.0548414 0.2036297 0.1390167 -0.3510875 0.0946797 0.0045663 0.0420007 -0.0390687 0.0972523 -0.0278261 0.0450015 -0.0075111 0.0655916 -0.0014596 -0.0251378 -0.0172261 -0.0181565 0.1057656 -0.0102544 -0.0159282 -0.0623583 0.06885 -0.0013839 -0.0530943 -0.0033337 -0.0222669 0.08121 -0.0272055 -0.0139893 0.0078916 -0.0044218 0.0371718 -0.046592 0.0100117 -0.0184513 0.1077273 -0.0587168 0.0091933 -0.0465015 0.0217924 0.0355774 -0.0497929 0.0231951 -0.0366782 0.1163274 0.0105689 0.0151521 -0.0245917 0.0309635 -0.2180643 0.0326385 0.1336959 0.0297712 -0.0997056 -0.0249277 0.2048939 -0.0373494 0.0099584 -0.2269038 0.0434222 0.1214522 0.0618062 -0.0648476 -0.034769 0.1873081 -0.0446227 0.0276744 1.0377855 0.3829563 -0.2544524 0.0855911 1.8966297 0.0365897 -0.361303 0.0007695 0.3629377 1.0330294 0.0829088 -0.2609595 0.3526322 1.9314618 -0.0301495 -0.3467587 0.054312 0.3574554 0.0542084 -0.0022355 -0.0375431 -0.0128492 0.0642991 0.0565151 -0.0117154 0.0158125 -0.1767202 0.0232376 0.0094257 -0.0045882 0.0388702 -0.1666113 -0.0226936 -0.0120329 0.0335651 0.0725565 0.0390146 0.0001088 -0.0239375 -0.0078635 -0.1406803 0.0859055 -0.0211042 0.037467 0.0480356 -0.0517533 0.0430457 0.1001518 0.0594967 0.0337324 -0.0670237 0.0947782 -0.0405892 -0.0035484 0.0688292 -0.0163759 0.0050218 -0.0802177 -0.1145124 0.0859389 0.0351625 0.0735839 -0.0068721 -0.1531241 0.0726587 0.0222652 0.1146494 0.0322182 -0.0133457 -0.0134629 -0.0059066 0.0636354 -0.0426698 0.0281943 -0.1154723 0.0634325 0.0523105 0.0749253 -0.0984849 0.0417819 -0.0652413 0.0594421 0.0285179 0.0318666 -0.0165809 -0.1437827 -0.0777881 0.0206241 -0.0280126 0.0421806 0.0458567 0.024121 -0.0322674 0.0276332 0.0935204 -0.0268018 -0.0532194 0.0241252 -0.0792361 0.0167307 -0.0786279 0.0065687 -0.0738906 -0.0085689 -0.0314087 -0.0220905 -0.0370309 0.1003337 0.0438105 0.0533501 0.0021809 0.0226573 -0.0501685 0.0394049 -0.0184073 0.065766 0.0904731 0.0352496 -0.0010984 -0.0236685 -0.0118409 0.1045777 0.0232872 -0.0627206 -0.024771 -0.0749542 unknown
polarizability: 106.0040625|5.3372351|108.4038086|-4.3627761|1.5926484|80.9588749 unknown
InChI: InChI=1S/C9H12O3/c10-7-5-9(3-1-2-4-9)6-8(11)12-7/h1-6H2
charge 0 multiplicity 1
24 atoms
O  -2.075454 0.32113 0.243174
O  -1.567651 2.553647 0.195628
O  -2.634492 -1.897611 0.334171
C  0.671812 -0.348029 -0.311708
C  2.007455 -0.666092 -1.0408
C  1.117875 -0.348261 1.182318
C  3.099223 0.119727 -0.258284
C  2.525741 0.318239 1.187835
C  0.134964 1.043086 -0.737757
C  -0.426788 -1.388011 -0.621847
C  -1.183815 1.409943 -0.076553
C  -1.772478 -1.071665 0.012701
H  1.977614 -0.405907 -2.115354
H  2.199115 -1.754927 -0.971894
H  1.191525 -1.397231 1.52914
H  0.40203 0.163575 1.851629
H  3.295934 1.097064 -0.73548
H  4.057723 -0.427637 -0.251577
H  3.176012 -0.135617 1.95548
H  2.449633 1.392993 1.432586
H  -0.027928 1.06074 -1.835574
H  0.847676 1.852332 -0.508403
H  -0.139294 -2.399267 -0.285466
H  -0.588833 -1.451022 -1.718465
