program: Gaussian 09
title: 000079748
version: EM64L-G09RevD.01
frameworkgroup: C1[X(C7H15N)]
method: RPBEPBE
basis: SDD
operation: Freq
keyword: #pfreq=noraman
keyword: PBEPBE/SDD
title: #p freq=noraman PBEPBE/SDD
converged: YES YES NO NO
title: Mulliken charges:
elementType: N C C C C C C C H H H H H H H H H H H H H H H
charge: -0.113873 -0.306800 -0.310151 -0.409607 -0.680437 -0.680294 -0.053839 -0.586865 0.203439 0.179510 0.224441 0.178424 0.208597 0.189215 0.207837 0.229434 0.207989 0.205743 0.228165 0.207673 0.238096 0.215899 0.217402
chargesum: 0.00000
title: Mulliken charges with hydrogens summed into heavy atoms:
elementType: N C C C C C C C
charge: -0.113873 0.076149 0.092715 -0.011795 -0.035177 -0.038712 0.184256 -0.153563
polarizability: 1.04019810e+02 -4.29636692e+00 7.89736574e+01 -3.11129901e+00 -2.92026284e-01 7.03703030e+01
1716.lowfreq: -16.4853 -3.2236 -0.0004 -0.0002 0.0005 12.3307 51.3681 76.9309 83.2154
frequency: 51.2359 76.9163 83.1141 87.4392 169.8449 209.5504 239.3200 266.4742 286.5661 398.0644 400.0606 450.4797 473.9999 613.7418 752.9861 796.5251 802.1753 896.3052 909.8010 945.3998 977.8709 994.8589 1014.2860 1065.1825 1075.4228 1086.4244 1101.3573 1149.6208 1164.4607 1200.7513 1250.8175 1271.8474 1279.8063 1288.0259 1345.3197 1364.1770 1373.5032 1386.4952 1387.6355 1426.0162 1457.0010 1464.7743 1468.2187 1473.7177 1479.0159 1487.3672 1492.3692 1656.4496 2839.9935 2844.3041 2858.9560 2983.6288 2983.8757 3009.5472 3029.9162 3036.2965 3074.4503 3076.6030 3083.9315 3090.8885 3091.9262 3104.2542 3194.4334
redmass: 2.1728 2.1812 1.9042 2.2363 1.3809 1.2539 2.5339 1.7802 1.8974 2.6423 2.1981 2.7303 2.2632 1.5566 2.3990 1.1344 1.2064 1.7117 1.6882 1.3291 1.6843 2.2244 1.2180 2.3430 1.9673 2.0242 1.9040 1.8639 2.0916 2.3189 1.3426 1.2166 1.1763 1.2014 1.3595 1.3249 1.3538 1.2324 1.2331 1.2047 1.0835 1.0543 1.0489 1.0560 1.0592 1.0625 1.0730 4.7384 1.0723 1.0718 1.0703 1.0358 1.0359 1.0852 1.0876 1.0872 1.0984 1.0975 1.0599 1.1002 1.1002 1.0940 1.1141
irintensity: 0.0154 0.4196 0.3988 0.3246 1.2838 0.0544 1.4062 0.7755 1.2972 3.8811 2.6841 5.3079 5.7369 7.2376 9.1231 6.5939 5.1353 5.0619 2.7210 80.4070 11.2178 9.3916 17.7000 30.5347 16.2688 4.4038 16.5810 4.0148 24.9090 25.0430 14.2979 1.8638 14.0405 21.5258 2.3797 4.4718 1.7976 21.4416 22.7001 11.8392 2.4138 5.5776 12.7361 2.0425 5.6361 9.3676 12.4943 9.8429 35.9445 46.8254 232.2006 42.2563 19.3166 23.4053 6.4101 14.2109 31.5249 87.5339 12.2626 36.6066 42.5604 10.3417 29.1160
temp: 298.150 k
press: 1.00000 atm
elementType: 7 6 6 6 6 6 6 6 1 1 1 1 1 1 1 1 1 1 1 1 1 1 1
symmnumber: 1
zpe: 540686.9 jmol-1
zpe.correction: 0.205937 hartree
zpe.thermalcorrener: 0.216565 hartree
zpe.thermalcorrenthalpy: 0.217509 hartree
zpe.thermalcorrgfe: 0.169579 hartree
zpe.sumelectzpe: -329.774758 hartree
zpe.sumelectthermal: -329.764130 hartree
zpe.sumelectthermalent: -329.763185 hartree
zpe.sumelectthermalfe: -329.811116 hartree
dipole: 0.3415 -0.0298 0.7795
dipole: 0.8515
quadrupole: -50.5986 -52.1346 -51.6945
quadrupole: -0.9190 0.5158 -0.1998
quadrupole: 0.8773 -0.6587 -0.2186 -0.9190 0.5158 -0.1998
hfenergy: -329.9806943 hartree
pointgroup: C01 [X(C7H15N1)]
dipole: 0.1326315 -0.0067663 0.3075568 debye
dipolederiv: -0.6543928 0.1003093 -0.0018194 -0.0759023 -0.654698 -0.00934 -0.0245328 0.0083649 -0.5416283 0.4338824 -0.2356617 0.0574604 -0.2696314 0.2317018 -0.0959862 0.040161 -0.0912987 0.4213543 0.0233062 0.0272044 0.0307196 0.0832632 0.5656794 0.0841196 0.0449849 0.0658315 0.4027777 0.4454647 0.2094642 -0.138078 0.312061 0.1797355 0.0335046 -0.0678464 0.0101329 0.3601381 0.0378806 0.0757949 0.0372906 0.1107322 -0.0705295 -0.0499701 0.0044492 -0.0565462 0.010476 0.0375112 -0.0958679 0.0332072 -0.0856969 -0.0544462 0.0566308 0.0487863 0.0371826 0.0108487 0.139776 -0.1095791 0.0165682 -0.1880987 -0.1554102 -0.0246221 0.086065 -0.0150404 0.1208588 -0.2326728 -0.0800035 0.0269092 -0.0741078 -0.4062429 -0.0449143 0.0294247 -0.0430618 0.099498 -0.1048582 -0.1004679 0.0061501 -0.119862 -0.0338532 -0.0126921 0.0174311 0.0064171 0.0613968 -0.0137053 0.0520539 0.0589625 0.0947045 -0.0210538 0.0395716 -0.0995919 0.0923135 -0.2915534 -0.1032677 0.0847322 -0.001134 0.0780818 0.0231666 0.0081544 -0.0151439 0.0162802 0.0565226 0.0436415 -0.0553529 -0.0413217 -0.0297957 -0.0736887 0.0182865 -0.0294741 -0.1298922 -0.2847699 0.0235928 0.0471137 -0.0069053 0.0022218 -0.1434636 -0.0179488 -0.0331739 -0.0364824 0.0623138 -0.086714 -0.0521954 0.0534971 -0.0253556 0.0588648 -0.0506227 0.1108242 0.0589179 -0.246579 -0.0303201 -0.1711559 0.0137581 -0.1312301 -0.047881 0.0009812 0.0426041 0.0117453 0.0727893 0.1036287 -0.0092404 0.000863 -0.0193959 0.0757527 0.0630002 0.0472095 0.0050086 -0.1460201 -0.1490502 0.1324922 -0.0637596 0.0935433 0.029521 0.0094013 -0.087307 0.0292078 0.0678407 -0.1759671 0.0344929 -0.0180448 0.0875085 0.0960711 0.0150758 -0.0445086 0.026267 0.067692 0.0734302 -0.0048791 -0.0482135 -0.0058648 0.1032932 -0.0460711 -0.018539 0.0235229 -0.1503276 0.079375 0.0408761 0.0228746 -0.0046609 -0.2026082 -0.0438382 0.018934 -0.0721912 0.0768391 0.0747438 0.0259521 0.0503138 0.0606172 0.1419269 0.0188331 -0.0125851 0.0160556 -0.1157267 -0.0593606 0.0554234 -0.0874677 0.0740264 0.177984 0.0320297 -0.1024015 0.0315692 0.0083465 0.0940758 0.0284943 -0.0018303 0.0328423 0.1801784 0.0164167 0.0442302 0.0056959 -0.1230875 unknown
polarizability: 103.8249935|-4.973358|79.1771037|-2.8337615|-0.4745406|70.3616733 unknown
InChI: InChI=1S/C7H15N/c1-4-7-8(5-2)6-3/h4H,1,5-7H2,2-3H3
charge 0 multiplicity 1
23 atoms
N  0.460096 0.003144 0.020964
C  1.709729 -0.64125 0.507457
C  0.354422 1.434629 0.418255
C  -0.757654 -0.767295 0.392267
C  2.090328 -1.908223 -0.282801
C  1.286359 2.357601 -0.389672
C  -1.958781 -0.377447 -0.445259
C  -3.192613 -0.09677 0.043734
H  2.52747 0.09349 0.398208
H  1.644975 -0.88222 1.600698
H  -0.691525 1.745816 0.241008
H  0.545582 1.566983 1.514907
H  -0.541927 -1.83786 0.208391
H  -1.007043 -0.672296 1.48033
H  1.344428 -2.715325 -0.166926
H  2.173771 -1.671899 -1.357875
H  3.061407 -2.30275 0.070197
H  2.354432 2.130419 -0.219499
H  1.08221 2.248644 -1.469086
H  1.121699 3.413064 -0.102893
H  -1.771939 -0.347957 -1.528764
H  -4.031874 0.144879 -0.61808
H  -3.399052 -0.105377 1.121839
