program: Gaussian 09
title: 000079739
version: EM64L-G09RevD.01
frameworkgroup: C1[X(C7H14O4)]
method: RPBEPBE
basis: SDD
operation: Freq
keyword: #pfreq=noraman
keyword: PBEPBE/SDD
title: #p freq=noraman PBEPBE/SDD
converged: YES YES NO NO
title: Mulliken charges:
elementType: O O O O C C C C C C C H H H H H H H H H H H H H H
charge: -0.240786 -0.239563 -0.485951 -0.471830 0.304477 -0.401299 -0.408391 -0.368410 -0.409966 0.073656 -0.707966 0.191453 0.263706 0.268682 0.181600 0.220081 0.236762 0.241569 0.188770 0.179950 0.220660 0.220961 0.237771 0.351456 0.352606
chargesum: 0.00000
title: Mulliken charges with hydrogens summed into heavy atoms:
elementType: O O O O C C C C C C C
charge: -0.240786 -0.239563 -0.134495 -0.119224 0.304477 0.053859 0.041892 0.088433 0.020374 0.253606 -0.028574
polarizability: 1.03377273e+02 8.10075776e-01 8.12000028e+01 -1.57085479e+00 -3.76881194e-01 7.76946767e+01
1716.lowfreq: -12.4089 -0.0013 -0.0012 -0.0009 3.6821 17.2889 81.8207 87.4019 126.2803
frequency: 81.8121 87.3915 126.2618 149.3659 173.1777 186.6824 212.8390 223.1912 237.8426 279.8465 296.9948 313.4772 326.4361 391.4386 463.5305 513.7790 531.2432 541.3640 656.4758 770.8530 792.5760 794.5729 901.7267 916.3462 928.5900 944.3063 969.8331 982.6290 996.3914 1028.5663 1070.8059 1088.7135 1102.5474 1140.0633 1145.3022 1171.2754 1198.2727 1211.8722 1225.7108 1251.0423 1278.9823 1321.8127 1329.5137 1347.3058 1358.1674 1367.8402 1390.0113 1399.3729 1408.5432 1448.6612 1457.6104 1459.6435 1466.7506 1467.8823 1474.6203 2879.2956 2927.2477 2937.1147 2946.0982 2980.3642 3010.4579 3027.9189 3049.2718 3101.1154 3109.5262 3116.6185 3116.7803 3594.8810 3598.5464
redmass: 3.8681 3.5476 3.1428 3.1551 1.1878 1.2415 3.0161 1.2045 3.0839 2.6307 2.9491 2.1544 3.2983 2.2464 4.1444 3.4426 4.3533 4.6693 3.6205 3.2577 2.9039 2.7268 2.2878 1.9798 1.6194 6.3136 5.9643 4.7878 4.4623 1.9215 2.3454 1.6784 1.7206 1.8117 1.8142 1.5505 1.3098 1.1634 1.1025 1.2695 1.7013 1.1976 1.6022 1.1859 1.4051 1.3829 1.4356 1.4142 1.3744 1.0773 1.0709 1.0608 1.0737 1.0475 1.0827 1.0835 1.0685 1.0684 1.0633 1.0562 1.0356 1.1003 1.1075 1.0936 1.0939 1.1002 1.1003 1.0669 1.0668
irintensity: 1.0065 2.5124 13.0273 9.1129 104.8455 19.0951 3.7795 170.3899 6.9247 1.4998 2.5360 5.6512 16.6044 0.6517 0.4642 7.7510 18.9284 2.8379 29.6505 2.6921 42.5308 29.6122 16.1018 28.2341 16.5824 20.1142 71.1466 74.8366 33.9727 22.5946 88.0490 65.0839 25.7833 45.0574 10.8172 7.5125 1.6574 26.6971 20.4360 4.2679 22.2761 8.8015 9.5654 4.6874 9.9561 3.4509 4.7424 51.2354 0.2399 14.1082 0.9274 15.0862 3.2315 4.4952 26.3980 76.5590 16.2095 39.7585 163.2338 34.6210 13.1498 27.2841 25.0213 10.8748 13.3188 23.3184 17.2632 4.5180 4.4467
temp: 298.150 k
press: 1.00000 atm
elementType: 8 8 8 8 6 6 6 6 6 6 6 1 1 1 1 1 1 1 1 1 1 1 1 1 1
symmnumber: 1
zpe: 549068.6 jmol-1
zpe.correction: 0.209129 hartree
zpe.thermalcorrener: 0.221466 hartree
zpe.thermalcorrenthalpy: 0.222410 hartree
zpe.thermalcorrgfe: 0.171604 hartree
zpe.sumelectzpe: -575.084001 hartree
zpe.sumelectthermal: -575.071664 hartree
zpe.sumelectthermalent: -575.070720 hartree
zpe.sumelectthermalfe: -575.121526 hartree
dipole: -1.7490 -0.2052 1.0672
dipole: 2.0591
quadrupole: -59.1469 -67.1392 -64.2096
quadrupole: -1.0428 -0.0573 -7.7979
quadrupole: 4.3516 -3.6406 -0.7110 -1.0428 -0.0573 -7.7979
hfenergy: -575.2931302 hartree
pointgroup: C01 [X(C7H14O4)]
dipole: 0.6818635 0.0552759 0.4339278 debye
dipolederiv: -0.9956598 -0.1781891 0.0721039 -0.0924138 -0.6225359 0.0819182 0.0919705 0.1390537 -0.4732853 -0.9437016 0.1555571 -0.1297995 0.1353192 -0.5908527 0.1734712 -0.0586725 0.1182565 -0.5187371 -0.6506089 0.177985 0.0841984 0.1637738 -0.740857 0.0796362 0.0718881 0.1323612 -0.2073086 -0.5140088 -0.18179 0.2197266 -0.2487461 -0.6460093 -0.0039688 0.2887587 -0.0021148 -0.4412254 -0.1732781 -0.0310381 -0.0192753 -0.0080526 -0.0940609 0.0774492 -0.0519132 0.0047274 -0.086426 0.6199873 0.0722234 0.0140433 -0.0216024 0.3301586 0.0542173 0.1557099 0.0986215 0.2394645 0.580621 -0.0458463 0.0826922 0.1327309 0.1808323 0.0462683 0.0366495 -0.0164112 0.3702633 0.3537882 -0.1551083 -0.04343 -0.1722498 0.5801222 -0.0481653 -0.0814917 -0.0278119 0.1611013 0.4873192 0.175052 -0.1627459 0.1962952 0.4115302 -0.0581368 -0.1312198 -0.0477207 0.3525417 1.0123987 -0.0351775 -0.0471325 -0.1509201 0.8677836 -0.1838483 -0.2275809 -0.1821441 0.6952028 -0.2088878 -0.0330176 -0.0661029 -0.0478191 0.0235971 -0.0084509 -0.0867017 -0.0056266 0.0126136 -0.0222796 0.0318919 0.0294531 0.0134792 -0.0427576 -0.0950696 -0.0480132 -0.1868757 -0.104907 0.029879 -0.056208 0.0489707 -0.045993 0.0560737 0.0493095 0.0543512 0.0958149 -0.0102855 0.0340207 0.0473835 -0.0624131 0.0420481 -0.0415761 0.0690829 -0.0435487 0.0376857 0.0989567 -0.0269006 0.0273505 0.0247894 -0.0426076 0.0013266 -0.18152 -0.0080098 -0.0831638 -0.1635844 -0.0184948 -0.0099933 0.1107628 -0.0000302 -0.0487753 0.1088528 0.0813962 0.1003011 -0.0288254 -0.0618298 -0.0171583 -0.1263641 -0.0384931 -0.0106966 -0.0281839 -0.1087609 0.0093192 0.0337341 -0.0476705 0.0680418 -0.0080502 0.0687846 -0.0589137 0.1095125 0.0188212 0.0824153 0.0600684 0.0173513 -0.0109145 0.1001991 -0.0172581 -0.0321195 -0.1115804 0.0767519 -0.0619048 -0.1890802 -0.0316512 -0.0383037 -0.0557547 0.0588126 -0.1181497 -0.0957547 0.0884208 -0.1027181 -0.1936399 0.0127896 -0.0573025 0.0601152 -0.0920126 0.0541322 0.0689684 0.0981409 0.079567 -0.0084292 0.029863 0.071032 -0.0310305 0.1174253 -0.0629531 0.0459888 -0.050917 0.0345553 0.0932261 0.0972423 0.0322752 0.047369 -0.0022267 0.040299 -0.1033006 -0.0045249 -0.1011334 -0.0376253 0.3529735 0.0119542 -0.0445745 0.0391854 0.2231934 -0.1030661 -0.0154059 -0.1574378 0.0883335 0.0667377 -0.0206993 -0.0977505 0.0125709 0.3412086 0.0563702 -0.1460987 0.0423842 0.2578533 unknown
polarizability: 103.3054516|1.0105392|81.1365462|1.9483971|0.7082773|77.8299547 unknown
InChI: InChI=1S/C7H14O4/c1-6-10-4-7(2-8,3-9)5-11-6/h6,8-9H,2-5H2,1H3
charge 0 multiplicity 1
25 atoms
O  -1.360682 1.010561 -0.767241
O  -1.455624 -0.983251 0.588457
O  1.814116 -1.966043 -0.603588
O  2.791497 1.417367 -0.018794
C  0.767165 0.083779 0.170832
C  -0.020371 1.354198 -0.250698
C  -0.119924 -0.720747 1.160139
C  1.085235 -0.768471 -1.073526
C  2.070484 0.496012 0.881808
C  -2.123607 0.273589 0.241887
C  -3.486203 -0.055969 -0.33718
H  -0.120861 2.03352 0.625835
H  0.487047 1.895125 -1.062396
H  0.314452 -1.712146 1.358086
H  -0.232039 -0.157381 2.114708
H  1.721193 -0.178287 -1.762495
H  0.138413 -1.049241 -1.572406
H  2.670649 -0.411403 1.088673
H  1.833367 1.012292 1.837718
H  -2.178628 0.904056 1.164785
H  -4.086096 -0.613554 0.400882
H  -4.014755 0.871994 -0.611083
H  -3.363878 -0.67694 -1.23997
H  1.870257 -2.623358 -1.338857
H  3.738893 1.4721 0.256524
