program: Gaussian 09
title: 000079747
version: EM64L-G09RevD.01
frameworkgroup: C1[X(C9H9NO3)]
method: RPBEPBE
basis: SDD
operation: Freq
keyword: #pfreq=noraman
keyword: PBEPBE/SDD
title: #p freq=noraman PBEPBE/SDD
converged: YES YES NO NO
title: Mulliken charges:
elementType: O O O N C C C C C C C C C H H H H H H H H H
charge: -0.304939 -0.270244 -0.199894 -0.626419 0.192631 0.271610 -0.358937 -0.335443 -0.243700 -0.205595 0.164068 0.273504 -0.752790 0.245092 0.253715 0.234009 0.235895 0.242560 0.238935 0.283626 0.326060 0.336254
chargesum: 0.00000
title: Mulliken charges with hydrogens summed into heavy atoms:
elementType: O O O N C C C C C C C C C
charge: -0.304939 -0.270244 -0.199894 0.035895 0.192631 0.271610 -0.113845 -0.081728 -0.009690 0.030300 0.164068 0.273504 0.012331
polarizability: 1.42884888e+02 6.43745691e+00 1.23002054e+02 -3.92498197e+00 1.23862459e+00 6.60337412e+01
1716.lowfreq: -7.5327 -0.0010 -0.0009 -0.0005 0.5164 6.2270 33.3290 75.6112 85.5264
frequency: 33.2974 75.6094 85.5262 94.6859 124.1967 129.1442 209.9301 244.9024 294.3087 347.3346 390.2719 421.7934 480.7409 502.0345 511.4297 529.9077 541.0200 589.0644 599.4311 639.5950 687.8530 709.6969 744.7610 779.9500 788.1146 863.3877 883.7452 956.1726 987.5237 991.1634 1033.8849 1038.8717 1048.0300 1082.5301 1137.7830 1151.3986 1174.4322 1197.8458 1266.2146 1340.5734 1375.9189 1379.6926 1430.4427 1449.6176 1456.5731 1472.3568 1569.4147 1588.4720 1609.6575 1631.5025 1698.0143 3008.2218 3103.2665 3129.5038 3141.9205 3143.6359 3161.4717 3176.2811 3521.9291 3677.1779
redmass: 7.0605 4.5688 4.3665 5.0739 1.0885 4.3631 6.0477 5.5798 4.0417 4.3854 4.7849 4.1494 3.5490 1.5238 2.0963 3.6943 3.9656 1.3217 4.6987 4.9836 4.3163 3.2024 4.3628 2.0241 2.6708 5.0675 1.6277 1.3902 2.1620 1.3375 2.2532 1.6431 2.4248 2.5775 1.7676 2.9550 1.0858 2.9678 1.4549 4.1011 1.2483 9.4968 2.2504 1.0583 1.0526 2.7182 3.8972 2.4536 5.8053 2.4128 10.7945 1.0364 1.0959 1.0869 1.1023 1.0896 1.0950 1.0995 1.0447 1.1043
irintensity: 1.9922 6.2279 8.0518 5.1813 0.6888 3.5262 1.1413 2.8511 1.3987 3.8841 6.1295 1.5727 27.2905 73.7443 71.9849 7.3251 9.1416 88.3356 15.4030 9.3872 28.1138 32.4594 18.2638 23.2165 59.3488 77.5333 8.2783 3.9974 88.0601 0.3908 7.6476 16.0376 8.4049 77.8122 8.0910 398.7398 3.2512 3.8961 1.0074 194.8711 80.7733 17.7739 9.8304 13.7373 22.4281 36.5664 67.2316 32.7051 47.5518 329.1708 181.2239 2.4244 6.0319 2.8938 11.7053 8.3291 20.1557 10.4770 43.3480 27.6252
temp: 298.150 k
press: 1.00000 atm
elementType: 8 8 8 7 6 6 6 6 6 6 6 6 6 1 1 1 1 1 1 1 1 1
symmnumber: 1
zpe: 433246.9 jmol-1
zpe.correction: 0.165015 hartree
zpe.thermalcorrener: 0.177362 hartree
zpe.thermalcorrenthalpy: 0.178306 hartree
zpe.thermalcorrgfe: 0.125620 hartree
zpe.sumelectzpe: -627.858101 hartree
zpe.sumelectthermal: -627.845754 hartree
zpe.sumelectthermalent: -627.844810 hartree
zpe.sumelectthermalfe: -627.897496 hartree
dipole: -3.6903 1.4511 -2.6224
dipole: 4.7541
quadrupole: -61.6620 -61.3286 -82.4382
quadrupole: -4.0455 -5.0244 0.4912
quadrupole: 6.8143 7.1477 -13.9620 -4.0455 -5.0244 0.4912
hfenergy: -628.023116 hartree
pointgroup: C01 [X(C9H9N1O3)]
dipole: -1.3720205 -0.5249363 1.1577573 debye
dipolederiv: -1.8721851 -0.202672 0.348935 -0.0649581 -0.3184509 0.0013703 0.3573372 0.047048 -0.6366188 -1.0032781 -0.0441053 0.2342793 0.123797 -0.670447 0.0517752 0.1485947 0.1486634 -0.4200239 -0.5869603 0.0240927 -0.1543197 -0.0464764 -0.3397185 0.1630433 0.3719526 0.2073505 -0.9194821 -0.4891875 -0.3094387 -0.0353729 -0.3752018 -1.0363305 0.2373636 -0.0253059 0.2049913 -0.6983807 -0.3142554 0.2021441 0.0426437 0.0553988 -0.3708988 0.0273266 -0.0405483 0.0303334 0.0023345 1.140196 0.2286881 -0.0341174 -0.012616 0.2671068 0.0203145 0.3266042 0.0302943 0.0108819 0.0316788 -0.1161589 0.0448682 0.0267929 0.0493743 0.0511038 0.0207215 0.0860313 -0.1278019 -0.309138 0.0365301 0.031658 0.1827685 0.0243124 0.0409693 -0.0342097 0.0099247 -0.1098006 0.0710484 0.0229697 0.0621028 0.0206711 -0.1974511 0.0102053 0.0593328 0.0071357 -0.1439761 0.0725292 -0.0189342 0.0390131 -0.04546 0.126176 -0.0017004 0.0433768 0.0061306 -0.1209122 1.1953214 0.0613231 -0.3747588 0.0356392 1.5413672 -0.4045767 -0.3008629 -0.452374 0.4701981 1.8523389 0.0560785 -0.1533326 0.0216658 0.3819147 -0.2333193 -0.9171749 -0.3305818 1.3916783 -0.3730344 0.0630961 -0.1195812 0.1699338 -0.050307 0.0846223 -0.1345957 0.0508856 -0.0561745 0.058947 -0.0513279 -0.015375 -0.0804563 -0.064474 -0.031893 -0.0100513 -0.0356764 0.139755 0.0697231 -0.0713262 -0.0326381 -0.0580691 -0.0193736 -0.0195019 -0.0229798 -0.0180934 0.1467988 -0.1060541 0.0015637 -0.0554215 -0.0148272 0.0818975 -0.0091825 -0.0622828 -0.0118727 0.1503818 0.0189596 0.0895381 -0.0149873 0.0999496 -0.0440939 0.0028954 -0.0205773 0.0031307 0.1539554 0.0968427 0.0160764 0.003787 -0.0434701 0.0887639 -0.0937951 -0.0227789 -0.0829846 -0.0358129 -0.0402759 -0.0436474 0.0549437 -0.0744169 0.1035999 0.0408326 0.0921608 0.0532247 0.0200261 0.1512149 -0.000378 -0.0197419 0.008242 -0.0124665 0.0131209 0.0141365 0.0177701 0.1267788 0.1517518 0.0389885 0.0791707 0.035198 0.2515132 0.012011 0.0906194 0.0027093 0.3192246 0.1838171 0.0168995 0.0682448 0.0358951 0.207986 0.0370149 0.0665309 0.0259592 0.3369703 unknown
polarizability: 143.8759123|-4.6770786|121.6269018|1.8877875|-5.7974247|66.4178695 unknown
InChI: InChI=1S/C9H9NO3/c1-6(11)13-8-5-3-2-4-7(8)9(10)12/h2-5H,10H2,1H3
charge 0 multiplicity 1
22 atoms
O  1.246991 0.880157 0.759849
O  1.363762 -1.807463 -0.093947
O  1.925254 1.180506 -1.470194
N  -0.486682 -2.884002 0.78985
C  -0.695859 -0.515544 0.207879
C  -0.122201 0.770619 0.396384
C  -2.083877 -0.58889 -0.083434
C  -0.902108 1.940044 0.319778
C  -2.873208 0.577197 -0.172004
C  -2.281651 1.844422 0.036273
C  0.153173 -1.760641 0.282733
C  2.225241 0.93161 -0.293403
C  3.585365 0.650721 0.285786
H  -2.541262 -1.564534 -0.284806
H  -0.418941 2.908485 0.479569
H  -3.938696 0.499415 -0.411785
H  -2.887303 2.754214 -0.031918
H  3.695839 1.113941 1.279246
H  4.370495 1.002495 -0.399365
H  3.668761 -0.44431 0.408334
H  -1.406698 -2.837899 1.223064
H  0.041705 -3.755143 0.83071
