program: Gaussian 09
title: 000079710
version: EM64L-G09RevD.01
frameworkgroup: C1[X(C12H10N6Si)]
method: RPBEPBE
basis: SDD
operation: Freq
keyword: #p
keyword: freq=noraman
keyword: PBEPBE/SDD
title: #p freq=noraman PBEPBE/SDD
converged: YES YES NO NO
title: Mulliken charges:
elementType: Si N N N N N N C C C C C C C C C C C C H H H H H H H H H H
charge: 1.481927 -0.423851 -0.423651 0.011861 0.011777 -0.049789 -0.049700 -0.260172 -0.259657 -0.266674 -0.266423 -0.287726 -0.288024 -0.229467 -0.229567 -0.233727 -0.233539 -0.222742 -0.222713 0.274179 0.273780 0.242557 0.242616 0.234751 0.234767 0.234648 0.234640 0.234959 0.234964
chargesum: 0.00000
title: Mulliken charges with hydrogens summed into heavy atoms:
elementType: Si N N N N N N C C C C C C C C C C C C
charge: 1.481927 -0.423851 -0.423651 0.011861 0.011777 -0.049789 -0.049700 -0.260172 -0.259657 0.007505 0.007356 -0.045169 -0.045408 0.005284 0.005200 0.000921 0.001101 0.012218 0.012250
polarizability: 2.30243941e+02 1.37177470e-01 2.01092582e+02 6.61385571e-01 -3.57180680e-02 1.60937408e+02
1716.lowfreq: -12.8075 -7.0322 0.0009 0.0010 0.0018 0.6350 28.0084 29.9703 32.3920
frequency: 27.8691 29.9473 32.1895 40.8592 45.9467 55.4788 73.3062 107.3064 144.5117 158.6919 209.8224 228.2069 239.0666 251.5906 287.9413 338.0536 392.6824 395.3195 454.0702 465.6803 492.0940 519.6568 522.2658 532.9218 534.1830 585.2224 608.2243 614.6861 623.4735 691.2524 705.4245 706.7040 714.6561 753.4674 754.2267 863.4380 866.8474 936.8791 938.5542 986.7229 987.5991 988.0939 989.1449 1007.6762 1007.7245 1023.2501 1024.9016 1078.0894 1078.6662 1102.6053 1114.4731 1176.2985 1176.3534 1196.3390 1197.7713 1311.3872 1314.1893 1320.5145 1322.0169 1370.8267 1371.7331 1421.2630 1422.5248 1470.9195 1472.0375 1578.4600 1579.1094 1599.1368 1599.4803 2088.2660 2103.6178 3117.3720 3117.7631 3129.2472 3129.2947 3140.2524 3140.3693 3151.5057 3151.5699 3165.4469 3165.7375
redmass: 3.9372 6.7703 4.4178 8.8010 7.7341 8.6213 8.3182 9.4211 7.3233 5.6695 6.4576 8.6936 7.7402 5.6403 6.4001 9.5097 2.7810 2.8133 4.4259 4.0656 10.0640 13.9814 13.9959 11.0488 10.6686 12.4184 8.3021 6.5254 10.2568 6.8741 1.9251 1.9349 6.4549 1.6883 1.6614 1.2462 1.2427 1.3459 1.3426 2.5491 6.1677 2.0535 1.3900 1.3238 1.3243 2.9490 2.7348 1.6916 1.6815 2.8280 3.1047 1.0570 1.0569 1.1277 1.1273 1.6653 1.5794 5.3941 6.1883 5.5528 5.9108 2.1330 2.1342 2.0235 2.0316 5.5503 5.6019 5.7678 5.7449 13.9993 13.9946 1.0882 1.0880 1.0866 1.0866 1.0913 1.0914 1.0961 1.0961 1.1016 1.1016
irintensity: 0.0821 0.3607 0.0169 0.2168 0.0064 0.0912 1.6560 1.1181 0.9189 0.6486 0.0367 8.2549 12.9735 0.8166 5.4129 14.8272 0.0500 0.0066 5.3182 0.8727 78.5520 9.0443 14.3418 71.7524 109.9194 73.4510 51.8595 3.4691 99.8597 37.5596 75.7704 53.7323 58.8269 26.2517 13.3377 0.0653 0.0273 0.1908 0.0001 1.7026 0.8321 1.3347 0.0076 0.1000 0.0623 0.6222 2.5576 3.7695 0.1719 35.5750 97.8222 0.2146 0.4397 10.1009 4.7271 37.2476 24.0260 131.4325 104.0506 0.0340 0.2775 26.2418 12.1589 3.6831 8.8339 0.1133 0.4089 1.1250 2.6942 710.1897 580.2061 7.9066 0.2534 0.5919 0.1537 14.1350 1.1196 25.6894 23.7698 45.6665 13.5079
temp: 298.150 k
press: 1.00000 atm
elementType: 14 7 7 7 7 7 7 6 6 6 6 6 6 6 6 6 6 6 6 1 1 1 1 1 1 1 1 1 1
symmnumber: 1
zpe: 537317.5 jmol-1
zpe.correction: 0.204653 hartree
zpe.thermalcorrener: 0.222512 hartree
zpe.thermalcorrenthalpy: 0.223456 hartree
zpe.thermalcorrgfe: 0.155170 hartree
zpe.sumelectzpe: -1079.805450 hartree
zpe.sumelectthermal: -1079.787592 hartree
zpe.sumelectthermalent: -1079.786647 hartree
zpe.sumelectthermalfe: -1079.854934 hartree
dipole: -0.0080 -4.8474 -0.0049
dipole: 4.8474
quadrupole: -101.8135 -121.7743 -122.3522
quadrupole: 0.0401 -9.7840 0.0187
quadrupole: 13.4998 -6.4610 -7.0389 0.0401 -9.7840 0.0187
hfenergy: -1080.0101035 hartree
pointgroup: C01 [X(C12H10N6Si1)]
dipole: 0.0008656 -1.9070978 0.0109457 debye
polarizability: 228.4363982|0.1192583|201.0906297|-11.0641785|-0.3308386|162.7469039 unknown
InChI: InChI=1S/C12H10N6Si/c13-15-17-19(18-16-14,11-7-3-1-4-8-11)12-9-5-2-6-10-12/h1-10H
charge 0 multiplicity 1
29 atoms
Si -0.001581 0.455996 -0.006216
N  0.16981 1.526071 1.444342
N  -0.174694 1.506815 -1.470397
N  1.05987 2.330636 1.798068
N  -1.058129 2.317008 -1.827747
N  1.835014 3.115054 2.236985
N  -1.827425 3.104849 -2.270809
C  -1.557588 -0.532638 0.383914
C  1.555916 -0.535034 -0.384417
C  -2.409092 -0.160917 1.458474
C  2.414142 -0.166088 -1.4546
C  -1.907907 -1.650309 -0.422887
C  1.901079 -1.650697 0.427346
C  -3.588984 -0.892049 1.720626
C  3.595735 -0.897736 -1.707377
C  -3.088076 -2.380294 -0.159381
C  3.082968 -2.381262 0.173161
C  -3.930758 -2.000617 0.91161
C  3.932485 -2.004158 -0.893319
H  -2.137614 0.692859 2.089204
H  2.146256 0.685436 -2.089903
H  -1.260243 -1.957235 -1.253965
H  1.248006 -1.955733 1.254869
H  -4.238904 -0.597604 2.551932
H  4.250816 -0.605503 -2.535402
H  -3.348774 -3.240099 -0.786243
H  3.339636 -3.23957 0.80373
H  -4.847138 -2.566397 1.114332
H  4.850176 -2.570384 -1.08873
