program: Gaussian 09
title: 000000366
version: EM64L-G09RevD.01
frameworkgroup: C1[X(C12H10O4)]
method: RPBEPBE
basis: SDD
operation: Freq
keyword: #pfreq=noraman
keyword: PBEPBE/SDD
title: #p freq=noraman PBEPBE/SDD
converged: YES YES NO NO
title: Mulliken charges:
elementType: O O O O C C C C C C C C C C C C H H H H H H H H H H
charge: -0.246286 -0.275877 -0.198047 -0.219089 0.230739 0.406519 0.226994 -0.360837 -0.550234 0.390494 -0.354925 -0.479732 -0.805220 0.126117 0.263406 -0.746060 0.247884 0.293610 0.305748 0.255614 0.242671 0.242576 0.241764 0.256625 0.248979 0.256568
chargesum: 0.00000
title: Mulliken charges with hydrogens summed into heavy atoms:
elementType: O O O O C C C C C C C C C C C C
charge: -0.246286 -0.275877 -0.198047 -0.219089 0.230739 0.406519 0.226994 -0.112953 -0.256624 0.390494 -0.049178 -0.224118 -0.078209 0.126117 0.263406 0.016113
polarizability: 2.50148770e+02 -1.32313502e+01 1.53220546e+02 -9.71995642e-02 -9.12760297e-03 6.57564771e+01
1716.lowfreq: -0.0007 -0.0006 0.0005 4.4069 7.3904 10.7558 28.2936 51.7750 78.4960
frequency: 28.2765 51.6761 78.4952 93.1607 120.2031 131.3419 168.2584 206.5500 224.7461 251.9223 256.1094 299.8808 329.9008 355.9176 424.9468 454.0602 477.9330 504.9549 544.3147 547.5303 553.2712 613.9903 626.9157 658.6877 670.2479 706.3646 745.4289 746.7957 789.0537 836.6624 845.5757 878.4187 890.2612 963.3400 975.1261 993.8974 997.9554 1040.3875 1046.6707 1054.2995 1108.9689 1132.1236 1162.9003 1175.7954 1220.5992 1246.2214 1262.6988 1377.6676 1384.3700 1388.1783 1402.9972 1422.2196 1451.3659 1452.5715 1466.7512 1470.4421 1494.2857 1547.5333 1605.5836 1625.0512 1666.9674 1688.5631 2982.6769 3009.8653 3059.3159 3097.6524 3103.8063 3146.5073 3155.4525 3171.2709 3189.5728 3217.6505
redmass: 6.8304 3.0810 1.1896 5.9984 4.9892 5.0241 1.6234 1.6465 8.6546 3.8354 6.9824 5.2591 3.6109 5.9492 7.4099 3.0584 5.1757 6.1921 3.8622 5.0230 3.3030 5.5514 4.5126 6.8636 3.8007 6.2408 3.5200 7.4785 5.7624 1.4344 8.2643 1.4008 1.5363 3.3061 1.3124 1.9275 1.8948 1.6440 1.5787 4.4377 2.0948 3.0869 2.3722 2.2767 3.3336 1.7551 1.3873 2.6901 1.4323 2.5060 1.4610 4.6163 1.0600 1.0462 1.0453 1.1062 3.4069 7.8359 7.1086 7.4425 9.8017 10.4576 1.0383 1.0368 1.0968 1.0973 1.0985 1.1012 1.0905 1.0922 1.0931 1.0946
irintensity: 5.6971 3.0952 0.0761 0.2817 4.7191 0.1551 0.0002 1.7398 1.7780 0.1635 0.2547 6.0910 2.5877 0.7597 2.7329 6.0838 0.4299 2.8438 1.9044 14.1087 0.4356 27.2022 2.4317 18.2488 6.6290 6.5696 1.1198 2.3038 62.3963 21.6345 8.6299 31.3065 57.4216 76.3978 1.0753 169.3845 80.1546 9.5197 8.2502 68.6236 200.0040 39.4944 249.6850 399.9502 5.5365 46.1056 0.9622 151.7919 61.3874 5.5396 42.9616 18.5818 22.7202 19.5160 17.3786 12.1413 15.3622 63.7129 72.9566 228.6010 200.9994 504.9953 10.8769 0.4870 11.8695 5.1202 20.1271 10.5852 6.7774 1.7564 1.1288 5.7531
temp: 298.150 k
press: 1.00000 atm
elementType: 8 8 8 8 6 6 6 6 6 6 6 6 6 6 6 6 1 1 1 1 1 1 1 1 1 1
symmnumber: 1
zpe: 502857.2 jmol-1
zpe.correction: 0.191528 hartree
zpe.thermalcorrener: 0.206000 hartree
zpe.thermalcorrenthalpy: 0.206944 hartree
zpe.thermalcorrgfe: 0.149084 hartree
zpe.sumelectzpe: -763.049561 hartree
zpe.sumelectthermal: -763.035089 hartree
zpe.sumelectthermalent: -763.034145 hartree
zpe.sumelectthermalfe: -763.092005 hartree
dipole: -2.7999 3.5569 0.0288
dipole: 4.5268
quadrupole: -91.2179 -95.2367 -92.9437
quadrupole: 29.5758 -0.1013 0.0537
quadrupole: 1.9149 -2.1040 0.1891 29.5758 -0.1013 0.0537
hfenergy: -763.2410889 hartree
pointgroup: C01 [X(C12H10O4)]
dipole: 1.0384668 1.4115158 -0.3179373 debye
dipolederiv: -1.3525989 -0.4250037 0.1043497 -0.1655842 -0.4553282 0.0556635 0.0503734 0.0590628 -0.2123081 -2.7320176 -0.1370648 0.0557119 -0.2534079 -0.4426735 0.0539531 0.0779155 0.052521 -0.195041 -0.9865086 -0.4112959 0.0945366 -0.7814964 -1.0071503 0.1498044 0.1720117 0.1449497 -0.3721334 -0.8152242 0.0499665 -0.0040636 -0.6335104 -0.8632461 0.1196426 0.1311552 0.1128189 -0.3118463 -0.6151162 0.0178958 0.0039475 0.1247756 -0.2825961 0.0511459 -0.0178165 0.0522997 -0.0412354 0.9207467 0.1046621 -0.0340235 -0.0800703 0.5498728 -0.1090528 0.0041287 -0.1117283 0.0461409 0.7286119 0.2970441 -0.0698358 0.2258096 0.3992228 -0.0601894 -0.055769 -0.0608647 0.1395855 0.387014 0.0171884 -0.0106871 0.10913 0.1312797 -0.0553107 -0.0292128 -0.0535452 -0.1126647 -0.5571958 -0.1383928 0.0331622 -0.0879241 -0.0551414 -0.0253554 0.0228359 -0.0252624 -0.179076 1.5416403 -0.0405528 -0.009263 -0.6555008 0.257011 -0.0258704 0.1162842 -0.0327246 0.1062479 -0.5475507 0.0464516 -0.0047657 0.4055688 -0.155144 -0.0065069 -0.0788719 -0.0010956 -0.1594756 -0.2555074 -0.0872252 0.0188537 -0.5151158 -0.7188194 0.1186077 0.1083935 0.1127321 -0.2091753 0.0061397 0.0092978 -0.0015307 0.1166056 -0.218426 0.0529942 -0.0239562 0.0551107 0.0317641 1.6502183 0.4912146 -0.1209837 0.9109571 1.3994801 -0.2450938 -0.2086286 -0.2393174 0.3357568 2.561387 0.0321145 -0.0316723 1.0645676 1.1749584 -0.1997812 -0.2386867 -0.1889364 0.2546379 -0.3284058 0.1675918 -0.0286821 0.3128398 -0.1944943 0.0368993 -0.0538285 0.037461 0.0058038 0.0800466 0.0551667 -0.0108758 0.0415162 -0.0523688 0.0397581 -0.0080926 0.0394418 0.1313822 0.1073382 0.0185402 -0.0027056 0.0417273 0.0419881 0.0301376 -0.0073647 0.03045 0.1821569 0.1359881 -0.0547833 0.012401 -0.0366884 0.0933066 0.0199272 0.0085453 0.0194044 0.1811019 -0.0340479 0.0434643 -0.0061721 0.036682 0.0673925 0.0200674 -0.0047767 0.0198393 0.1623261 0.0750484 -0.0169393 0.093223 -0.002932 0.051131 0.0437457 0.0607597 0.0706367 -0.0492961 0.0699787 -0.0565175 -0.0812198 -0.0297009 -0.0061653 -0.0607585 -0.0572147 -0.0872293 0.0132663 -0.1385358 0.0697882 -0.0102934 -0.040163 0.0880008 0.0060821 0.0126259 0.0041181 0.112827 0.082542 0.0029173 0.0412843 -0.009237 0.1085156 0.0641263 0.0044957 0.073117 -0.0270738 -0.0651078 -0.0424082 0.0091444 -0.0879116 0.0457562 0.0167444 0.0172071 0.0170683 0.1283728 0.081117 -0.0131204 -0.03984 -0.0109368 0.0436377 -0.0913805 -0.0025129 -0.1003277 0.0379557 unknown
polarizability: 248.7627216|16.6134552|150.8166351|-5.8393822|-17.8822106|69.5464364 unknown
InChI: InChI=1S/C12H10O4/c1-7-5-12(14)16-11-6-9(15-8(2)13)3-4-10(7)11/h3-6H,1-2H3
charge 0 multiplicity 1
26 atoms
O  -1.699876 -1.598217 0.423611
O  2.907881 -0.534873 0.137754
O  -3.901113 -2.269106 0.593848
O  4.15199 1.431597 -0.263383
C  -1.142116 0.755821 -0.076097
C  -2.566901 1.078134 -0.122974
C  -0.756803 -0.592079 0.200459
C  -0.101893 1.702215 -0.288796
C  0.593992 -0.97786 0.262731
C  1.589464 -0.006264 0.046113
C  1.256335 1.348433 -0.233304
C  -3.488629 0.072786 0.100189
C  -3.016985 2.492668 -0.411267
C  -3.131419 -1.313393 0.383959
C  4.106212 0.210852 -0.02154
C  5.279397 -0.724722 0.151133
H  -0.361389 2.743566 -0.503619
H  0.862206 -2.0149 0.47613
H  2.038818 2.088046 -0.398196
H  -4.563099 0.274291 0.073819
H  -2.652442 2.83426 -1.398292
H  -2.622007 3.198457 0.343424
H  -4.11599 2.5684 -0.407988
H  5.242419 -1.201443 1.145805
H  6.217723 -0.16328 0.039667
H  5.234224 -1.53239 -0.599787
