program: Gaussian 09
title: 000000354
version: EM64L-G09RevD.01
frameworkgroup: C1[X(C7H8O5)]
method: RPBEPBE
basis: SDD
operation: Freq
keyword: #p
keyword: freq=noraman
keyword: PBEPBE/SDD
title: #p freq=noraman PBEPBE/SDD
converged: YES YES NO NO
title: Mulliken charges:
elementType: O O O O O C C C C C C C H H H H H H H H
charge: -0.411362 -0.229342 -0.168570 -0.375030 -0.221146 -0.467765 -0.477449 -0.060133 0.193933 -0.305153 0.076116 0.120929 0.247996 0.240671 0.270149 0.259195 0.259608 0.279408 0.381464 0.386479
chargesum: 0.00000
title: Mulliken charges with hydrogens summed into heavy atoms:
elementType: O O O O O C C C C C C C
charge: -0.029898 -0.229342 -0.168570 0.011450 -0.221146 0.020902 0.051895 0.199475 0.193933 -0.025745 0.076116 0.120929
polarizability: 1.49276164e+02 -3.42147903e+00 8.21690743e+01 -4.61815917e+00 1.12087388e+00 5.88863604e+01
1716.lowfreq: -12.3899 -1.2473 0.0007 0.0007 0.0010 2.1724 23.4876 28.3271 36.6546
frequency: 23.3909 28.2379 36.5423 61.3019 76.2887 131.4371 153.8481 173.5088 240.6591 299.0504 373.0299 403.3809 430.6778 460.4256 505.4494 522.6860 585.7753 628.7790 642.5527 644.6253 744.7130 775.9013 836.7657 858.7875 886.2272 972.7862 1007.2915 1020.1861 1040.6380 1077.1025 1093.8867 1127.6482 1176.7753 1236.3445 1257.8537 1270.6885 1292.7648 1313.9402 1346.6643 1370.3128 1439.6251 1456.1168 1582.8064 1619.4857 1651.7729 1667.2318 2978.4681 2997.6753 3050.6800 3069.2328 3084.4367 3152.7113 3507.6394 3513.3104
redmass: 11.7638 5.9877 7.4378 4.7893 2.7646 3.4152 3.5770 7.5975 4.2068 5.8083 4.6867 4.6716 4.0381 3.7642 2.5453 3.5984 4.5461 3.8996 1.2971 1.3313 2.3449 1.9963 5.5786 3.9941 2.2826 1.9858 1.4296 2.6012 2.6513 2.3943 2.1700 1.6280 1.6557 1.3277 1.2074 1.5333 1.3279 1.9068 2.0772 1.8465 1.0801 1.0961 11.8523 9.9727 6.2224 8.3678 1.0641 1.0641 1.0934 1.0968 1.0922 1.0921 1.0642 1.0640
irintensity: 1.5371 0.4870 2.8282 1.9358 1.6789 0.7018 1.1169 1.6838 4.9621 5.4788 1.5367 28.2073 20.9576 22.7022 14.1592 25.6831 4.0357 85.5904 142.6702 173.0003 3.3481 13.0190 17.6447 2.7095 2.2242 81.7573 194.7610 236.1864 49.4336 132.8087 39.9956 7.6170 3.1501 20.6109 9.0555 70.3989 0.7516 10.9051 9.9263 53.0847 22.7828 27.5606 250.0847 165.4934 156.2950 213.8216 5.5120 11.2036 3.5366 9.1079 14.1527 5.5850 40.9993 25.5573
temp: 298.150 k
press: 1.00000 atm
elementType: 8 8 8 8 8 6 6 6 6 6 6 6 1 1 1 1 1 1 1 1
symmnumber: 1
zpe: 376226.3 jmol-1
zpe.correction: 0.143297 hartree
zpe.thermalcorrener: 0.156100 hartree
zpe.thermalcorrenthalpy: 0.157044 hartree
zpe.thermalcorrgfe: 0.100603 hartree
zpe.sumelectzpe: -646.741396 hartree
zpe.sumelectthermal: -646.728593 hartree
zpe.sumelectthermalent: -646.727649 hartree
zpe.sumelectthermalfe: -646.784089 hartree
dipole: 1.5134 -0.4470 1.1291
dipole: 1.9404
quadrupole: -55.2893 -78.8314 -71.2005
quadrupole: 9.0248 3.0742 -1.6146
quadrupole: 13.1511 -10.3910 -2.7601 9.0248 3.0742 -1.6146
hfenergy: -646.8846925 hartree
pointgroup: C01 [X(C7H8O5)]
dipole: -0.5980002 0.197253 0.431573 debye
dipolederiv: -0.9229383 -0.2350421 0.5076361 -0.1932758 -0.4479885 0.1010634 0.5134356 0.1181969 -0.7731044 -0.7481039 0.1452745 -0.1485416 0.0516455 -0.4942251 0.3112697 0.0998369 0.2645335 -0.7744304 -0.6541868 -0.0010994 -0.0390655 0.5146635 -0.7033882 0.0044938 0.0071465 -0.0444956 -0.2992363 -1.227934 0.4315856 -0.0443902 0.3422352 -0.381991 0.0458476 -0.0681253 0.0596902 -0.3962358 -0.7642658 -0.1151803 -0.0659697 0.1917269 -0.8445634 -0.039387 -0.0369953 -0.0840067 -0.3229921 -0.2933005 0.0497826 -0.0175247 -0.0637944 0.0919744 0.027865 -0.1894039 0.0633911 0.0576201 -0.2995748 0.1162374 -0.0299687 0.3868032 0.0329338 0.0950523 -0.1963503 0.1010327 0.0440606 0.8693742 -0.0769071 0.1100868 0.1320593 0.125503 0.0614546 0.2566216 0.026215 -0.0797481 1.5156117 -0.0865139 -0.2408596 -0.1231068 0.527693 -0.5292459 -0.3425942 -0.5169264 1.167758 -1.3531453 0.1246076 -0.093381 -0.1522322 -0.0034989 -0.0028846 -0.1813091 0.0288806 -0.2046988 1.450397 -0.0249371 0.1388476 -0.6009307 0.667862 -0.0114189 0.0962259 0.0406516 0.2498626 1.4598625 -0.3070661 0.1099063 -0.4973912 0.9764674 0.027328 0.1032099 0.0541397 0.2539484 0.0793577 -0.007746 -0.0716266 0.0384303 0.0961521 -0.0247628 0.0310459 -0.0296208 -0.0391866 0.0389829 -0.0411626 0.0067741 0.0007386 -0.1041673 -0.0184287 0.0486937 -0.0428591 0.0789942 0.0611925 -0.0033744 -0.0183711 -0.0379208 0.107505 -0.0358264 0.023474 -0.0205278 -0.0610566 0.0880235 0.0039177 0.0037472 -0.0242259 -0.0672801 -0.0022139 0.0042217 -0.0324556 0.1053551 0.0716156 0.0183627 -0.0052844 0.006605 -0.0522962 -0.0199572 -0.029509 -0.0066466 0.1336767 0.1283657 0.0162285 -0.007295 0.0491278 -0.0139952 -0.0158784 -0.0007278 -0.017494 0.1709378 0.1854978 0.0814397 -0.0702129 0.1084365 0.3306821 0.073531 -0.1097835 0.0813546 0.2918619 0.3151685 -0.0884071 -0.0245071 -0.129594 0.156621 -0.0479017 -0.0291134 -0.0430535 0.3966137 unknown
polarizability: 149.2851824|-2.6993096|81.9243819|5.092153|-2.4286148|59.1220345 unknown
InChI: InChI=1S/C7H8O5/c8-5(7(11)12)3-1-2-4-6(9)10/h1,3,9,11H,2,4H2
charge 0 multiplicity 1
20 atoms
O  -4.854826 -0.369613 1.060085
O  -4.341785 0.705773 -0.934141
O  2.434198 -1.735871 -0.216035
O  4.690914 -0.272731 0.249645
O  3.423791 1.67457 0.322625
C  -1.518804 0.200075 -0.598873
C  -2.560559 -0.44838 0.345075
C  -0.16375 -0.43544 -0.454266
C  -3.968414 0.039645 0.05533
C  1.001561 0.234652 -0.208562
C  2.288029 -0.488141 -0.101362
C  3.502164 0.43185 0.177356
H  -1.877471 0.07165 -1.641144
H  -1.467881 1.288358 -0.419721
H  -2.326237 -0.250522 1.40638
H  -2.560416 -1.551166 0.234235
H  -0.105062 -1.530932 -0.565311
H  1.029272 1.322447 -0.083206
H  -5.77396 -0.056395 0.838775
H  5.442238 0.356571 0.430016
