program: Gaussian 09
title: 000079530
version: EM64L-G09RevD.01
frameworkgroup: C1[X(C11H8N2)]
method: RPBEPBE
basis: SDD
operation: Freq
keyword: #pfreq=noraman
keyword: PBEPBE/SDD
title: #p freq=noraman PBEPBE/SDD
converged: YES YES NO NO
title: Mulliken charges:
elementType: N N C C C C C C C C C C C H H H H H H H H
charge: 0.005110 0.005706 0.327485 0.150766 -0.378265 -0.378042 -0.776381 -0.208573 -0.208524 -0.231811 0.207004 -0.249824 -0.233162 0.244923 0.244989 0.255269 0.255302 0.262212 0.234886 0.234896 0.236035
chargesum: 0.00000
title: Mulliken charges with hydrogens summed into heavy atoms:
elementType: N N C C C C C C C C C C C
charge: 0.005110 0.005706 0.327485 0.150766 -0.133342 -0.133053 -0.003598 0.026313 0.026372 0.004224 0.207004 -0.249824 -0.233162
polarizability: 1.70771749e+02 -4.38759371e+00 1.06772703e+02 2.76811926e-02 8.70429832e-02 9.63843355e+01
1716.lowfreq: -55.6997 -14.2825 -0.0001 0.0005 0.0006 1.9905 10.2246 61.5817 67.0152
frequency: -55.6563 61.5260 67.0149 131.3512 142.8119 158.8476 171.0005 230.5892 275.4104 300.0455 392.6472 429.6770 446.7757 499.2708 529.7046 567.3716 589.4807 614.2244 653.8084 681.2711 703.0690 764.3716 822.3917 851.6948 921.7344 975.5571 987.2813 999.1063 1021.1193 1022.8738 1059.5901 1075.6792 1084.4002 1176.5168 1185.6596 1191.3635 1307.3628 1312.5179 1368.7254 1392.3414 1428.0656 1448.4213 1452.8655 1477.0949 1583.1240 1590.3940 1612.3575 2177.7050 2185.0965 2975.2379 3047.8750 3105.6421 3129.7420 3132.7114 3144.5427 3155.2342 3170.7668
redmass: 3.9224 7.1153 6.7486 11.0504 1.9314 1.4047 5.2848 7.3511 5.3157 3.4086 2.8320 7.9268 9.5491 4.4933 4.7857 4.4432 11.9964 6.5190 5.8133 6.2353 1.7638 1.8521 3.4393 1.2430 1.3803 1.3850 6.1979 1.3239 1.5786 2.5500 2.4363 2.5591 1.6149 1.0526 6.2304 1.1520 4.6659 1.3870 6.1749 1.1960 2.1687 1.0597 1.1262 2.3176 5.8743 6.3158 6.2230 12.6332 12.6378 1.0377 1.0953 1.0999 1.0854 1.0882 1.0924 1.0967 1.1018
irintensity: 0.5845 0.7321 1.2451 3.9542 0.0144 0.7825 1.4524 5.0719 1.2239 0.1625 0.0003 0.3962 0.2019 5.4573 1.2418 7.8858 0.1040 0.0491 2.7186 0.4009 51.2203 52.5524 0.0274 0.0609 2.6269 0.0115 3.1262 0.1677 3.2436 10.1792 31.8992 2.3278 6.7157 0.0265 7.3831 1.6666 9.8000 0.9788 0.0884 30.9353 13.6209 17.1068 31.7192 7.3450 1.8142 31.7925 2.8481 9.0996 11.1348 3.0293 4.7768 13.1891 1.8363 0.2296 8.8495 27.0371 18.3667
temp: 298.150 k
press: 1.00000 atm
elementType: 7 7 6 6 6 6 6 6 6 6 6 6 6 1 1 1 1 1 1 1 1
symmnumber: 1
zpe: 406629.0 jmol-1
zpe.correction: 0.154877 hartree
zpe.thermalcorrener: 0.166097 hartree
zpe.thermalcorrenthalpy: 0.167041 hartree
zpe.thermalcorrgfe: 0.117310 hartree
zpe.sumelectzpe: -532.536260 hartree
zpe.sumelectthermal: -532.525040 hartree
zpe.sumelectthermalent: -532.524096 hartree
zpe.sumelectthermalfe: -532.573827 hartree
dipole: -4.6468 -4.0064 0.0083
dipole: 6.1355
quadrupole: -86.1574 -84.1736 -67.9722
quadrupole: -3.8576 0.0108 0.0583
quadrupole: -6.7230 -4.7392 11.4622 -3.8576 0.0108 0.0583
hfenergy: -532.6911372 hartree
pointgroup: C01 [X(C11H8N2)]
dipole: -1.88028 -1.5137431 0.0001032 debye
dipolederiv: -0.3334215 -0.0199693 0.0001381 0.0472322 -0.1964201 -0.0000329 0.0001036 -0.0000349 -0.2242485 -0.1878242 -0.0036902 -0.0000897 -0.0564038 -0.2617289 0.0004307 0.0001615 0.0002146 -0.2155858 0.0388618 0.0373422 0.0000849 -0.0433606 -0.1237936 0.0002192 -0.000091 0.0002557 -0.0114918 0.6210097 0.1874913 -0.0001185 0.3177823 0.5283169 -0.0005256 -0.0000468 -0.0004434 -0.0365966 -0.116719 -0.0398498 -0.0802767 -0.0011994 -0.1159617 0.0015458 0.080074 0.024084 0.0521116 -0.1172845 -0.0394703 0.0804977 -0.0036802 -0.1161289 -0.0004475 -0.0799726 -0.0230165 0.0520362 -0.1789916 -0.0892076 -0.000032 -0.0438601 -0.3241694 0.0001723 0.0007191 0.0003068 0.01611 -0.0382426 -0.0347211 0.0901461 -0.0281814 -0.1177436 -0.029396 0.0477762 -0.0351554 0.0807918 -0.0382781 -0.0351504 -0.0899394 -0.0280773 -0.1171451 0.0306708 -0.0474662 0.036396 0.0806441 0.1075808 -0.0692664 0.0000899 -0.0723269 -0.1317934 0.0002345 0.0001048 0.0002343 -0.0648108 -0.098898 -0.1990824 0.0002256 -0.1796497 -0.0071168 0.0000224 -0.0002926 0.0000101 0.1285461 0.2602151 0.030392 -0.0000767 -0.0763743 -0.1035502 0.0001084 -0.0004523 0.0001477 0.0392657 -0.0799308 -0.0039119 0.0000062 0.073987 0.2003924 -0.0004716 -0.0001848 -0.0004415 0.047741 0.0566148 0.0340371 0.0912743 0.0194991 0.1307705 -0.0193982 0.0801355 -0.0131118 -0.02376 0.0564514 0.0334724 -0.0914548 0.0190322 0.130897 0.0182883 -0.080282 0.012095 -0.0237177 0.1081337 0.0176227 -0.0893788 -0.0671194 0.0558832 -0.0239928 -0.0814055 -0.0790365 0.0007075 0.1081946 0.0178266 0.0892548 -0.0671688 0.0558986 0.0239413 0.0814819 0.0789207 0.0005112 -0.0955892 0.078782 0.0000214 0.0504086 0.0699222 0.0000706 0.0000558 0.0000216 0.1212452 0.0175772 0.0191771 -0.0768851 0.0349577 0.1495392 0.0198962 -0.0896478 0.0180221 -0.0553442 0.0177984 0.0196086 0.0766077 0.0356642 0.1492725 -0.0211483 0.0893375 -0.0192747 -0.0552217 -0.1072581 0.0585674 -0.000095 0.0688389 0.1446591 -0.0001877 -0.0001082 -0.000194 0.0910667 unknown
polarizability: 170.4035118|-6.5331269|107.1406028|0.0464398|0.1014726|96.3846729 unknown
InChI: InChI=1S/C11H8N2/c1-9(11(7-12)8-13)10-5-3-2-4-6-10/h2-6H,1H3
charge 0 multiplicity 1
21 atoms
N  4.219192 -0.487072 0.001838
N  1.110763 2.719043 -0.000247
C  -0.784091 -0.437712 0.000257
C  0.663998 -0.828695 0.000617
C  -1.478946 -0.272574 -1.225527
C  -1.477617 -0.264907 1.225732
C  0.971515 -2.304863 0.001527
C  -2.850279 0.065826 -1.222979
C  -2.848987 0.073369 1.222542
C  -3.538771 0.238102 -0.00037
C  1.654866 0.137211 0.000259
C  3.056982 -0.205127 0.000921
C  1.346135 1.546958 -0.000568
H  -0.946086 -0.395148 -2.175306
H  -0.943736 -0.381604 2.175674
H  0.506661 -2.784741 -0.88134
H  0.507197 -2.7835 0.885354
H  2.051403 -2.522682 0.001367
H  -3.376816 0.20043 -2.173925
H  -3.374526 0.213795 2.173199
H  -4.60126 0.504091 -0.000623
