program: Gaussian 09
title: 000079504
version: EM64L-G09RevD.01
frameworkgroup: C1[X(C11H12O2)]
method: RPBEPBE
basis: SDD
operation: Freq
keyword: #pfreq=noraman
keyword: PBEPBE/SDD
title: #p freq=noraman PBEPBE/SDD
converged: YES YES NO NO
title: Mulliken charges:
elementType: O O C C C C C C C C C C C H H H H H H H H H H H H
charge: -0.282888 -0.232025 -0.445626 -0.546962 -0.544719 0.327076 0.284097 -0.525829 -0.400970 0.364006 -0.407791 0.257001 -0.750907 0.218159 0.224480 0.230223 0.227589 0.224777 0.226519 0.311064 0.242582 0.252770 0.251089 0.245305 0.250980
chargesum: 0.00000
title: Mulliken charges with hydrogens summed into heavy atoms:
elementType: O O C C C C C C C C C C C
charge: -0.282888 -0.232025 -0.002987 -0.089150 -0.093424 0.327076 0.284097 -0.214765 -0.158388 0.364006 -0.155021 0.257001 -0.003532
polarizability: 1.77982851e+02 1.16882763e+00 1.27306557e+02 -1.36179120e+00 1.19520426e+00 6.75063677e+01
1716.lowfreq: -8.0160 -6.2105 -0.0007 -0.0006 -0.0001 4.4406 30.2242 54.9526 73.4289
frequency: 30.1628 54.9495 73.4213 130.2971 136.6216 167.9210 225.7491 275.4293 296.3361 332.4010 411.9659 424.6443 478.3084 543.9152 557.3667 567.3037 614.9246 634.0332 698.7428 721.6365 761.3147 827.0251 847.6233 855.1198 882.3029 909.8915 918.0104 930.9285 953.7848 999.2531 1018.9248 1038.7475 1048.9357 1080.8993 1120.9081 1132.2870 1155.7744 1180.0097 1190.3507 1206.2329 1242.0851 1260.5614 1285.4865 1291.3279 1315.4345 1381.2754 1384.4094 1426.5603 1452.3262 1454.0366 1457.2814 1459.3231 1477.6716 1478.7892 1598.2212 1612.0265 1651.4739 2971.2481 2974.7393 3004.5816 3007.4847 3043.0730 3048.6216 3077.6750 3095.7840 3132.2766 3143.6073 3167.9918 3196.8998
redmass: 4.9538 1.8894 1.4778 4.7112 2.7353 2.5915 2.3719 5.0250 4.5024 3.7968 3.9979 2.8061 4.3973 3.2097 3.9872 3.0140 3.3366 3.7380 3.2316 4.5702 3.3834 1.4084 3.1656 3.2237 1.5943 2.1823 1.6002 2.9701 1.3503 1.8738 2.3064 1.6379 1.6825 2.4150 1.4542 1.3757 1.4066 2.5406 2.3538 1.3555 2.2900 1.2731 2.1937 1.2799 1.4102 1.9260 2.2857 4.3213 1.0658 1.0470 1.2739 1.0942 1.9257 1.1433 7.8659 7.2870 9.4955 1.0657 1.0657 1.0647 1.0367 1.0954 1.0942 1.1041 1.0973 1.0896 1.1011 1.0954 1.0931
irintensity: 2.6806 2.3850 0.8663 3.8953 0.1663 0.4246 1.4855 1.8710 1.2881 6.3066 3.6063 6.7242 3.3846 3.9047 4.2406 2.7673 3.7397 3.5334 3.9489 2.1448 4.0541 39.7912 6.5341 15.3956 11.0730 9.4579 26.0659 14.3342 1.4975 108.9321 5.8854 9.3228 5.6639 6.7338 61.7339 27.7719 11.1317 372.7476 117.0945 14.9448 42.8232 26.1895 5.1128 2.7796 4.1401 33.6458 23.4462 12.9170 27.8803 18.4697 23.6591 14.8059 61.6204 21.2708 2.7675 13.2478 194.7166 38.8227 31.6283 36.2988 2.1748 30.6659 33.4065 54.5458 7.6328 14.2186 10.4860 7.4571 3.2770
temp: 298.150 k
press: 1.00000 atm
elementType: 8 8 6 6 6 6 6 6 6 6 6 6 6 1 1 1 1 1 1 1 1 1 1 1 1
symmnumber: 1
zpe: 529507.4 jmol-1
zpe.correction: 0.201679 hartree
zpe.thermalcorrener: 0.213578 hartree
zpe.thermalcorrenthalpy: 0.214522 hartree
zpe.thermalcorrgfe: 0.162447 hartree
zpe.sumelectzpe: -575.881135 hartree
zpe.sumelectthermal: -575.869236 hartree
zpe.sumelectthermalent: -575.868291 hartree
zpe.sumelectthermalfe: -575.920367 hartree
dipole: 0.7010 1.4941 0.0202
dipole: 1.6505
quadrupole: -61.6695 -76.4179 -77.5885
quadrupole: -5.4705 -0.7701 0.0594
quadrupole: 10.2225 -4.5260 -5.6965 -5.4705 -0.7701 0.0594
hfenergy: -576.0828135 hartree
pointgroup: C01 [X(C11H12O2)]
dipole: -0.2344288 0.6045595 0.0347822 debye
dipolederiv: -1.8923892 0.5461811 -0.0178671 0.890807 -0.8126099 -0.0133764 0.0120603 -0.0247193 -0.1834778 -0.601924 -0.1771672 -0.0181697 0.4819904 -1.0040315 -0.024538 0.0234192 -0.0446825 -0.2979887 0.0958942 0.0528052 -0.0521951 0.0456686 0.0118171 -0.0312385 0.032385 0.0001873 0.1465303 -0.016981 -0.010659 -0.0289896 -0.0565436 0.0020684 0.0090274 0.0088619 0.03028 0.1621897 -0.0242953 -0.046101 -0.0125515 0.0141463 0.045956 -0.041733 0.0490814 -0.0412379 0.1652726 -0.0116486 0.124702 0.0004521 0.3311208 0.1881945 0.0300574 -0.0322329 -0.0240102 -0.0599208 0.2430089 -0.0087542 0.0065619 -0.2059515 -0.2074766 -0.0250587 -0.0933421 -0.0088625 -0.0646481 -0.275846 -0.0460472 -0.0078962 -0.0903558 -0.1019221 -0.0033216 0.0029034 0.0032887 -0.1588664 0.0009268 0.0079393 0.0006662 -0.0501878 0.1553847 0.0225332 0.0124469 0.0255455 -0.1543839 1.2278197 -0.2582184 0.0164433 -0.15969 0.1541998 0.00239 0.0233247 0.0055656 0.0861637 -0.2710539 0.0296339 -0.002265 0.1553553 -0.0539931 0.0098635 0.0136259 0.0038023 -0.1820148 1.7607804 -0.1695796 0.0285903 -1.1938893 1.5732795 0.0424541 -0.0468369 0.0748879 0.2075496 -0.4501704 -0.0841958 -0.0121271 -0.1931564 -0.0403518 -0.0068529 -0.0007076 -0.0033931 0.0209348 -0.1825811 -0.1009335 0.0408236 -0.1113443 0.0254298 0.0181498 0.0805894 0.0332988 0.0649718 0.0841089 0.0144114 0.0062648 0.0220927 0.0504555 0.0148184 -0.0714501 -0.0140269 -0.1755727 0.0283303 0.0445469 0.0276443 0.0078545 -0.0717868 -0.0946165 -0.0147079 -0.1375572 0.0057378 -0.0026733 -0.0590767 0.0129685 -0.0377959 0.0067851 0.0752651 0.0269509 0.1249382 -0.0970912 -0.063345 0.0138731 0.0644183 -0.031922 0.0644317 -0.0266135 0.113612 -0.0592234 -0.1173506 -0.0224308 0.0539197 -0.0459948 0.0874822 -0.0696033 0.0776665 -0.1127998 0.0923042 0.0246618 0.1654862 0.0206359 0.0004443 0.0197435 0.0413413 -0.0087963 -0.0054275 -0.0116285 0.173673 0.040444 0.085995 0.0019899 0.0666019 -0.0855531 -0.0150542 -0.0058619 -0.0135076 0.1490196 0.02095 -0.0944232 -0.011124 -0.092408 0.0150157 -0.0127948 -0.010149 -0.0104791 0.1710495 0.0718763 -0.0023642 0.0013559 -0.0109855 0.0671246 0.0968377 0.0426021 0.090844 -0.0046625 -0.0036256 0.0592383 -0.0042613 0.1140611 -0.0239827 0.0025624 -0.0065409 -0.0010285 0.1281012 0.0793385 0.0036384 0.0048181 -0.0026939 0.069827 -0.097631 -0.0418065 -0.0905858 -0.0098781 unknown
polarizability: 177.462457|-4.8815521|127.4542758|3.5746028|4.0600137|67.8790426 unknown
InChI: InChI=1S/C11H12O2/c1-8(12)13-11-6-5-9-3-2-4-10(9)7-11/h5-7H,2-4H2,1H3
charge 0 multiplicity 1
25 atoms
O  2.31378 0.365156 0.151456
O  2.703359 -1.957528 0.025691
C  -3.696461 -0.768708 -0.529828
C  -2.447716 -1.607026 -0.110177
C  -3.42317 0.668676 0.016837
C  -1.342288 -0.561253 -0.024102
C  -1.901619 0.740472 0.048697
C  0.051565 -0.770507 0.010558
C  -1.058716 1.865717 0.156936
C  0.879353 0.37508 0.113474
C  0.341229 1.680803 0.186225
C  3.125264 -0.784642 0.104452
C  4.577042 -0.359399 0.160223
H  -4.643011 -1.195371 -0.155083
H  -3.755973 -0.732574 -1.633657
H  -2.220493 -2.421464 -0.821017
H  -2.604015 -2.077972 0.881865
H  -3.834692 0.784485 1.040632
H  -3.88361 1.456469 -0.606426
H  0.485442 -1.76958 -0.043766
H  -1.474322 2.878092 0.213121
H  1.029612 2.528079 0.260004
H  4.82256 0.264676 -0.716882
H  5.220634 -1.250603 0.172556
H  4.762147 0.252323 1.059713
